{"text_format":"1","workbook":"xlsx","n_sheets":6,"sheets":["Instructions","Step 1_Risk Calculator","Step 2-3_Benefit & Cost Calc","Other Parameter Lookup","Risk Factor Weights Lookup","CMF Lookup"],"not_rendered":{"charts":0,"images":1,"macros":1,"external_links":0,"defined_names":1,"comments":0,"pivot_tables":0},"unopened":[],"bounds":{"document_bytes":16777216,"sheet_cells":100000,"rows_first":2000,"rows_last":500,"rows_between":2000,"halvings":0,"cell_chars":16384,"cell_head_chars":4096},"cells_cut":0,"cells_raw":0,"read":"whole","date_system":"1900"}

{"sheet":"Instructions","index":0,"n_rows":48,"n_cols":4,"rows_kept":48,"cut":false,"hidden":false,"merged":[[27,0,27,5],[21,0,22,1],[21,3,22,12],[24,3,24,12],[0,1,0,12],[1,1,1,12],[2,1,2,12],[4,0,4,12],[18,0,19,1],[18,3,19,12],[6,0,7,12],[3,0,3,12]]}
[null,"OREGON DEPARTMENT OF TRANSPORTATION"]
[null,"Highway Safety Projects "]
[null,"RISK-BASED CEI ANALYSIS WORKSHEET"]
["October 2023"]
["Instructions"]
["Background"]
["The risk factors and weighting factors contained in this tool were developed using a combination of national research, the Oregon Statewide Pedestrian and Bicycle Safety Plan, and statistical analysis (overrepresentation analysis) of bicycle and pedestrian crashes on state highways in Oregon. This worksheet should be used for all ARTS Systemic Bicycle/Pedestrian applications."]
[]
["Link to Oregon Pedestrian and Bicycle Plan"]
[]
{"$rows_left_out":39}
{"sheet":"Step 1_Risk Calculator","index":1,"n_rows":25,"n_cols":34,"rows_kept":25,"cut":false,"hidden":false,"merged":[[23,4,23,5],[23,7,23,8],[23,10,23,11],[8,0,9,0],[11,0,13,0],[20,0,22,0],[14,0,19,0],[8,8,9,8],[8,14,9,14],[1,0,1,10],[4,0,7,0],[4,4,4,5],[5,4,5,5],[6,4,6,5],[7,4,7,5],[6,7,6,8],[4,13,4,14],[8,11,9,11],[4,7,4,8],[7,7,7,8],[6,10,6,11],[5,10,5,11],[5,7,5,8],[4,10,4,11],[8,33,9,33],[24,4,24,5],[24,7,24,8],[24,10,24,11],[24,13,24,14],[24,16,24,17],[23,19,23,20],[23,16,23,17],[8,17,9,17],[8,20,9,20],[24,19,24,20],[23,13,23,14],[8,5,9,5],[23,22,23,23],[24,22,24,23],[23,25,23,26],[7,10,7,11],[7,19,7,20],[6,19,6,20],[5,19,5,20],[4,19,4,20],[7,13,7,14],[6,13,6,14],[5,13,5,14],[7,16,7,17],[6,16,6,17],[5,16,5,17],[4,16,4,17],[24,25,24,26],[4,22,4,23],[5,22,5,23],[6,22,6,23],[7,22,7,23],[8,23,9,23],[4,25,4,26],[5,25,5,26],[6,25,6,26],[7,25,7,26],[8,26,9,26],[23,28,23,29],[24,28,24,29],[4,31,4,32],[5,31,5,32],[6,31,6,32],[7,31,7,32],[8,32,9,32],[23,31,23,32],[24,31,24,32],[4,28,4,29],[5,28,5,29],[6,28,6,29],[7,28,7,29],[8,29,9,29]]}
[]
["   Step 1: Enter location details for each site included in your application. Risk scores are automatically calculated for each site."]
[]
[null,"Data Input","Notes",null,"Site 1","Site 1 Risk Score",null,"Site 2","Site 2 Risk Score",null,"Site 3","Site 3 Risk Score",null,"Site 4","Site 4 Risk Score",null,"Site 5","Site 5 Risk Score",null,"Site 6","Site 6 Risk Score",null,"Site 7","Site 7 Risk Score",null,"Site 8","Site 8 Risk Score",null,"Site 9","Site 9 Risk Score",null,"Site 10","Site 10 Risk Score","Total Score"]
["Project Site Details","Location Description","Include intersecting street names or segment start/end points. Include milepoints, if applicable.",null,null,null,null,null,null,"Market Street at Childs Place"]
[null,"Intersection or Segment"]
[null,"Segment Length (miles)","0.25 mile minimum"]
[null,"Context","Rural or Urban"]
["Crash History","Has a Minor or Possible Injury Crash involving a Bicyclist or Pedestrian occurred here?","Most recent five years of ODOT official data",null,null,{"$f":"IF(AND(E9=\"\",E10=\"\"),\"\",IF(E10='Risk Factor Weights Lookup'!$B$6,'Risk Factor Weights Lookup'!$C$6*'Risk Factor Weights Lookup'!$C$2,IF(E9='Risk Factor Weights Lookup'!$B$4,'Risk Factor Weights Lookup'!$C$4*'Risk Factor Weights Lookup'!$C$2,'Risk Factor Weights Lookup'!$C$3*'Risk Factor Weights Lookup'!$C$2)))","v":""},null,null,{"$f":"IF(AND(H9=\"\",H10=\"\"),\"\",IF(H10='Risk Factor Weights Lookup'!$B$6,'Risk Factor Weights Lookup'!$C$6*'Risk Factor Weights Lookup'!$C$2,IF(H9='Risk Factor Weights Lookup'!$B$4,'Risk Factor Weights Lookup'!$C$4*'Risk Factor Weights Lookup'!$C$2,'Risk Factor Weights Lookup'!$C$3*'Risk Factor Weights Lookup'!$C$2)))","v":""},null,null,{"$f":"IF(AND(K9=\"\",K10=\"\"),\"\",IF(K10='Risk Factor Weights Lookup'!$B$6,'Risk Factor Weights Lookup'!$C$6*'Risk Factor Weights Lookup'!$C$2,IF(K9='Risk Factor Weights Lookup'!$B$4,'Risk Factor Weights Lookup'!$C$4*'Risk Factor Weights Lookup'!$C$2,'Risk Factor Weights Lookup'!$C$3*'Risk Factor Weights Lookup'!$C$2)))","v":""},null,null,{"$f":"IF(AND(N9=\"\",N10=\"\"),\"\",IF(N10='Risk Factor Weights Lookup'!$B$6,'Risk Factor Weights Lookup'!$C$6*'Risk Factor Weights Lookup'!$C$2,IF(N9='Risk Factor Weights Lookup'!$B$4,'Risk Factor Weights Lookup'!$C$4*'Risk Factor Weights Lookup'!$C$2,'Risk Factor Weights Lookup'!$C$3*'Risk Factor Weights Lookup'!$C$2)))","v":""},null,null,{"$f":"IF(AND(Q9=\"\",Q10=\"\"),\"\",IF(Q10='Risk Factor Weights Lookup'!$B$6,'Risk Factor Weights Lookup'!$C$6*'Risk Factor Weights Lookup'!$C$2,IF(Q9='Risk Factor Weights Lookup'!$B$4,'Risk Factor Weights Lookup'!$C$4*'Risk Factor Weights Lookup'!$C$2,'Risk Factor Weights Lookup'!$C$3*'Risk Factor Weights Lookup'!$C$2)))","v":""},null,null,{"$f":"IF(AND(T9=\"\",T10=\"\"),\"\",IF(T10='Risk Factor Weights Lookup'!$B$6,'Risk Factor Weights Lookup'!$C$6*'Risk Factor Weights Lookup'!$C$2,IF(T9='Risk Factor Weights Lookup'!$B$4,'Risk Factor Weights Lookup'!$C$4*'Risk Factor Weights Lookup'!$C$2,'Risk Factor Weights Lookup'!$C$3*'Risk Factor Weights Lookup'!$C$2)))","v":""},null,null,{"$f":"IF(AND(W9=\"\",W10=\"\"),\"\",IF(W10='Risk Factor Weights Lookup'!$B$6,'Risk Factor Weights Lookup'!$C$6*'Risk Factor Weights Lookup'!$C$2,IF(W9='Risk Factor Weights Lookup'!$B$4,'Risk Factor Weights Lookup'!$C$4*'Risk Factor Weights Lookup'!$C$2,'Risk Factor Weights Lookup'!$C$3*'Risk Factor Weights Lookup'!$C$2)))","v":""},null,null,{"$f":"IF(AND(Z9=\"\",Z10=\"\"),\"\",IF(Z10='Risk Factor Weights Lookup'!$B$6,'Risk Factor Weights Lookup'!$C$6*'Risk Factor Weights Lookup'!$C$2,IF(Z9='Risk Factor Weights Lookup'!$B$4,'Risk Factor Weights Lookup'!$C$4*'Risk Factor Weights Lookup'!$C$2,'Risk Factor Weights Lookup'!$C$3*'Risk Factor Weights Lookup'!$C$2)))","v":""},null,null,{"$f":"IF(AND(AC9=\"\",AC10=\"\"),\"\",IF(AC10='Risk Factor Weights Lookup'!$B$6,'Risk Factor Weights Lookup'!$C$6*'Risk Factor Weights Lookup'!$C$2,IF(AC9='Risk Factor Weights Lookup'!$B$4,'Risk Factor Weights Lookup'!$C$4*'Risk Factor Weights Lookup'!$C$2,'Risk Factor Weights Lookup'!$C$3*'Risk Factor Weights Lookup'!$C$2)))","v":""},null,null,{"$f":"IF(AND(AF9=\"\",AF10=\"\"),\"\",IF(AF10='Risk Factor Weights Lookup'!$B$6,'Risk Factor Weights Lookup'!$C$6*'Risk Factor Weights Lookup'!$C$2,IF(AF9='Risk Factor Weights Lookup'!$B$4,'Risk Factor Weights Lookup'!$C$4*'Risk Factor Weights Lookup'!$C$2,'Risk Factor Weights Lookup'!$C$3*'Risk Factor Weights Lookup'!$C$2)))","v":""},{"$f":"AVERAGE(F9,I9,L9,O9,R9,U9,X9,AA9,AD9,AG9)","v":{"$error":"#DIV/0!"}}]
[null,"Has a Fatal or Serious Injury Crash involving a Bicyclist or Pedestrian occurred here?","Most recent five years of ODOT official data"]
{"$rows_left_out":16}
{"sheet":"Step 2-3_Benefit & Cost Calc","index":2,"n_rows":32,"n_cols":32,"rows_kept":32,"cut":false,"hidden":false,"merged":[[1,0,1,12],[17,0,17,12],[18,0,18,12],[3,12,3,13],[3,15,3,16],[3,18,3,19],[3,9,3,10],[3,3,3,4],[3,6,3,7],[11,0,12,0],[13,18,13,19],[13,3,13,4],[13,6,13,7],[13,9,13,10],[13,12,13,13],[13,15,13,16],[4,18,4,19],[5,18,5,19],[6,18,6,19],[7,18,7,19],[4,9,4,10],[5,9,5,10],[6,9,6,10],[7,9,7,10],[29,0,31,0],[4,12,4,13],[5,12,5,13],[6,12,6,13],[7,12,7,13],[4,15,4,16],[5,15,5,16],[6,15,6,16],[7,15,7,16],[20,12,20,13],[20,15,20,16],[3,1,3,2],[20,1,20,2],[20,3,20,4],[20,6,20,7],[13,0,13,1],[21,0,23,0],[21,3,21,4],[22,3,22,4],[23,3,23,4],[21,6,21,7],[23,6,23,7],[22,6,22,7],[4,3,4,4],[5,3,5,4],[6,3,6,4],[7,3,7,4],[4,6,4,7],[5,6,5,7],[6,6,6,7],[7,6,7,7],[20,9,20,10],[8,0,10,0],[4,0,7,0],[20,18,20,19],[27,0,27,3],[21,15,21,16],[22,15,22,16],[23,15,23,16],[21,18,21,19],[22,18,22,19],[23,18,23,19],[21,9,21,10],[22,9,22,10],[23,9,23,10],[21,12,21,13],[22,12,22,13],[23,12,23,13],[13,21,13,22],[3,24,3,25],[4,24,4,25],[5,24,5,25],[6,24,6,25],[7,24,7,25],[13,24,13,25],[3,21,3,22],[4,21,4,22],[5,21,5,22],[6,21,6,22],[7,21,7,22],[13,27,13,28],[3,30,3,31],[4,30,4,31],[5,30,5,31],[6,30,6,31],[7,30,7,31],[13,30,13,31],[3,27,3,28],[4,27,4,28],[5,27,5,28],[6,27,6,28],[7,27,7,28],[20,27,20,28],[21,27,21,28],[22,27,22,28],[23,27,23,28],[20,30,20,31],[21,30,21,31],[22,30,22,31],[23,30,23,31],[20,21,20,22],[21,21,21,22],[22,21,22,22],[23,21,23,22],[20,24,20,25],[21,24,21,25],[22,24,22,25],[23,24,23,25]]}
[]
["                   Step 2: Enter the countermeasures that will be applied to each site. Note that benefit calculations are limited to three total countermeasures across all sites."]
[]
[null,"Data Input",null,"Site 1",null,null,"Site 2 ",null,null,"Site 3",null,null,"Site 4",null,null,"Site 5",null,null,"Site 6",null,null,"Site 7",null,null,"Site 8",null,null,"Site 9",null,null,"Site 10"]
["Project Site Details","Location Description",null,{"$f":"IF('Step 1_Risk Calculator'!E5=\"\",\"\",'Step 1_Risk Calculator'!E5)","v":""},null,null,{"$f":"IF('Step 1_Risk Calculator'!H5=\"\",\"\",'Step 1_Risk Calculator'!H5)","v":""},null,null,{"$f":"IF('Step 1_Risk Calculator'!K5=\"\",\"\",'Step 1_Risk Calculator'!K5)","v":""},null,null,{"$f":"IF('Step 1_Risk Calculator'!N5=\"\",\"\",'Step 1_Risk Calculator'!N5)","v":""},null,null,{"$f":"IF('Step 1_Risk Calculator'!Q5=\"\",\"\",'Step 1_Risk Calculator'!Q5)","v":""},null,null,{"$f":"IF('Step 1_Risk Calculator'!T5=\"\",\"\",'Step 1_Risk Calculator'!T5)","v":""},null,null,{"$f":"IF('Step 1_Risk Calculator'!W5=\"\",\"\",'Step 1_Risk Calculator'!W5)","v":""},null,null,{"$f":"IF('Step 1_Risk Calculator'!Z5=\"\",\"\",'Step 1_Risk Calculator'!Z5)","v":""},null,null,{"$f":"IF('Step 1_Risk Calculator'!AC5=\"\",\"\",'Step 1_Risk Calculator'!AC5)","v":""},null,null,{"$f":"IF('Step 1_Risk Calculator'!AF5=\"\",\"\",'Step 1_Risk Calculator'!AF5)","v":""}]
[null,"Intersection or Segment",null,{"$f":"IF('Step 1_Risk Calculator'!E6=\"\",\"\",'Step 1_Risk Calculator'!E6)","v":""},null,null,{"$f":"IF('Step 1_Risk Calculator'!H6=\"\",\"\",'Step 1_Risk Calculator'!H6)","v":""},null,null,{"$f":"IF('Step 1_Risk Calculator'!K6=\"\",\"\",'Step 1_Risk Calculator'!K6)","v":""},null,null,{"$f":"IF('Step 1_Risk Calculator'!N6=\"\",\"\",'Step 1_Risk Calculator'!N6)","v":""},null,null,{"$f":"IF('Step 1_Risk Calculator'!Q6=\"\",\"\",'Step 1_Risk Calculator'!Q6)","v":""},null,null,{"$f":"IF('Step 1_Risk Calculator'!T6=\"\",\"\",'Step 1_Risk Calculator'!T6)","v":""},null,null,{"$f":"IF('Step 1_Risk Calculator'!W6=\"\",\"\",'Step 1_Risk Calculator'!W6)","v":""},null,null,{"$f":"IF('Step 1_Risk Calculator'!Z6=\"\",\"\",'Step 1_Risk Calculator'!Z6)","v":""},null,null,{"$f":"IF('Step 1_Risk Calculator'!AC6=\"\",\"\",'Step 1_Risk Calculator'!AC6)","v":""},null,null,{"$f":"IF('Step 1_Risk Calculator'!AF6=\"\",\"\",'Step 1_Risk Calculator'!AF6)","v":""}]
[null,"Segment Length (miles)",null,{"$f":"IF('Step 1_Risk Calculator'!E7=\"\",\"\",'Step 1_Risk Calculator'!E7)","v":""},null,null,{"$f":"IF('Step 1_Risk Calculator'!H7=\"\",\"\",'Step 1_Risk Calculator'!H7)","v":""},null,null,{"$f":"IF('Step 1_Risk Calculator'!K7=\"\",\"\",'Step 1_Risk Calculator'!K7)","v":""},null,null,{"$f":"IF('Step 1_Risk Calculator'!N7=\"\",\"\",'Step 1_Risk Calculator'!N7)","v":""},null,null,{"$f":"IF('Step 1_Risk Calculator'!Q7=\"\",\"\",'Step 1_Risk Calculator'!Q7)","v":""},null,null,{"$f":"IF('Step 1_Risk Calculator'!T7=\"\",\"\",'Step 1_Risk Calculator'!T7)","v":""},null,null,{"$f":"IF('Step 1_Risk Calculator'!W7=\"\",\"\",'Step 1_Risk Calculator'!W7)","v":""},null,null,{"$f":"IF('Step 1_Risk Calculator'!Z7=\"\",\"\",'Step 1_Risk Calculator'!Z7)","v":""},null,null,{"$f":"IF('Step 1_Risk Calculator'!AC7=\"\",\"\",'Step 1_Risk Calculator'!AC7)","v":""},null,null,{"$f":"IF('Step 1_Risk Calculator'!AF7=\"\",\"\",'Step 1_Risk Calculator'!AF7)","v":""}]
[null,"Context",null,{"$f":"IF('Step 1_Risk Calculator'!E8=\"\",\"\",'Step 1_Risk Calculator'!E8)","v":""},null,null,{"$f":"IF('Step 1_Risk Calculator'!H8=\"\",\"\",'Step 1_Risk Calculator'!H8)","v":""},null,null,{"$f":"IF('Step 1_Risk Calculator'!K8=\"\",\"\",'Step 1_Risk Calculator'!K8)","v":""},null,null,{"$f":"IF('Step 1_Risk Calculator'!N8=\"\",\"\",'Step 1_Risk Calculator'!N8)","v":""},null,null,{"$f":"IF('Step 1_Risk Calculator'!Q8=\"\",\"\",'Step 1_Risk Calculator'!Q8)","v":""},null,null,{"$f":"IF('Step 1_Risk Calculator'!T8=\"\",\"\",'Step 1_Risk Calculator'!T8)","v":""},null,null,{"$f":"IF('Step 1_Risk Calculator'!W8=\"\",\"\",'Step 1_Risk Calculator'!W8)","v":""},null,null,{"$f":"IF('Step 1_Risk Calculator'!Z8=\"\",\"\",'Step 1_Risk Calculator'!Z8)","v":""},null,null,{"$f":"IF('Step 1_Risk Calculator'!AC8=\"\",\"\",'Step 1_Risk Calculator'!AC8)","v":""},null,null,{"$f":"IF('Step 1_Risk Calculator'!AF8=\"\",\"\",'Step 1_Risk Calculator'!AF8)","v":""}]
["Countermeasures Applied","Countermeasure 1   |   CRF",null,null,{"$f":"IF(D9=\"\",\"\",VLOOKUP(D9,'CMF Lookup'!$C$2:$I$32,7,FALSE))","v":""},null,null,{"$f":"IF(G9=\"\",\"\",VLOOKUP(G9,'CMF Lookup'!$C$2:$I$32,7,FALSE))","v":""},null,null,{"$f":"IF(J9=\"\",\"\",VLOOKUP(J9,'CMF Lookup'!$C$2:$I$32,7,FALSE))","v":""},null,null,{"$f":"IF(M9=\"\",\"\",VLOOKUP(M9,'CMF Lookup'!$C$2:$I$32,7,FALSE))","v":""},null,null,{"$f":"IF(P9=\"\",\"\",VLOOKUP(P9,'CMF Lookup'!$C$2:$I$32,7,FALSE))","v":""},null,null,{"$f":"IF(S9=\"\",\"\",VLOOKUP(S9,'CMF Lookup'!$C$2:$I$32,7,FALSE))","v":""},null,null,{"$f":"IF(V9=\"\",\"\",VLOOKUP(V9,'CMF Lookup'!$C$2:$I$32,7,FALSE))","v":""},null,null,{"$f":"IF(Y9=\"\",\"\",VLOOKUP(Y9,'CMF Lookup'!$C$2:$I$32,7,FALSE))","v":""},null,null,{"$f":"IF(AB9=\"\",\"\",VLOOKUP(AB9,'CMF Lookup'!$C$2:$I$32,7,FALSE))","v":""},null,null,{"$f":"IF(AE9=\"\",\"\",VLOOKUP(AE9,'CMF Lookup'!$C$2:$I$32,7,FALSE))","v":""}]
[null,"Countermeasure 2   |   CRF",null,null,{"$f":"IF(D10=\"\",\"\",VLOOKUP(D10,'CMF Lookup'!$C$2:$I$32,7,FALSE))","v":""},null,null,{"$f":"IF(G10=\"\",\"\",VLOOKUP(G10,'CMF Lookup'!$C$2:$I$32,7,FALSE))","v":""},null,null,{"$f":"IF(J10=\"\",\"\",VLOOKUP(J10,'CMF Lookup'!$C$2:$I$32,7,FALSE))","v":""},null,null,{"$f":"IF(M10=\"\",\"\",VLOOKUP(M10,'CMF Lookup'!$C$2:$I$32,7,FALSE))","v":""},null,null,{"$f":"IF(P10=\"\",\"\",VLOOKUP(P10,'CMF Lookup'!$C$2:$I$32,7,FALSE))","v":""},null,null,{"$f":"IF(S10=\"\",\"\",VLOOKUP(S10,'CMF Lookup'!$C$2:$I$32,7,FALSE))","v":""},null,null,{"$f":"IF(V10=\"\",\"\",VLOOKUP(V10,'CMF Lookup'!$C$2:$I$32,7,FALSE))","v":""},null,null,{"$f":"IF(Y10=\"\",\"\",VLOOKUP(Y10,'CMF Lookup'!$C$2:$I$32,7,FALSE))","v":""},null,null,{"$f":"IF(AB10=\"\",\"\",VLOOKUP(AB10,'CMF Lookup'!$C$2:$I$32,7,FALSE))","v":""},null,null,{"$f":"IF(AE10=\"\",\"\",VLOOKUP(AE10,'CMF Lookup'!$C$2:$I$32,7,FALSE))","v":""}]
{"$rows_left_out":23}
{"sheet":"Other Parameter Lookup","index":3,"n_rows":36,"n_cols":2,"rows_kept":36,"cut":false,"hidden":true,"merged":[]}
[null,"Interest Rate"]
[null,0.05]
[]
[]
[]
[null,"List of Applied Countermeasures"]
[null,{"$f":"IF('Step 2-3_Benefit & Cost Calc'!D9=\"\",\"\",'Step 2-3_Benefit & Cost Calc'!D9)","v":""}]
[null,{"$f":"IF('Step 2-3_Benefit & Cost Calc'!D10=\"\",\"\",'Step 2-3_Benefit & Cost Calc'!D10)","v":""}]
[null,{"$f":"IF('Step 2-3_Benefit & Cost Calc'!D11=\"\",\"\",'Step 2-3_Benefit & Cost Calc'!D11)","v":""}]
[null,{"$f":"IF('Step 2-3_Benefit & Cost Calc'!G9=\"\",\"\",'Step 2-3_Benefit & Cost Calc'!G9)","v":""}]
{"$rows_left_out":27}
{"sheet":"Risk Factor Weights Lookup","index":4,"n_rows":84,"n_cols":8,"rows_kept":84,"cut":false,"hidden":true,"merged":[]}
[]
[null,"Minor or Possible Injury Crashes involing a Bicyclist or Pedestrian (5 Year Total)",20,null,null,null,"Intersection",{"$f":"C2+C8+C15+C21+C31+C36+C48+C53+C58+C64+C78","v":226}]
[null,"No",0,null,null,null,"Segment",{"$f":"C2+C8+C15+C21+C25+C48+C53+C58+C64+C71+C78","v":219}]
[null,"Yes",0.5]
[null,"Fatal or Serious Injury Crashes involing a Bicyclist or Pedestrian (5 Year Total)"]
[null,"Yes",1]
[]
[null,"Average Annual Daily Traffic",21]
[null,"0-500",0]
[null,"501-1,500",0.25]
{"$rows_left_out":75}
{"sheet":"CMF Lookup","index":5,"n_rows":32,"n_cols":9,"rows_kept":32,"cut":false,"hidden":true,"merged":[]}
["CM No","Name","Full Name","Target Crash","Target Severity","Service Life","Facility","Area type","CRF"]
["BP1","Install Pedestrian Countdown Timer(s)","BP1: Install Pedestrian Countdown Timer(s)","Pedestrian","All",20,"Signalized   ","Either",0.7]
["BP2","Provide Intersection Lighting (Bike & Ped)","BP2: Provide Intersection Lighting (Bike & Ped)","P & B Night","All Injury (Excludes PDO's)",20,"Signalized or Unsignalized","Either",0.42]
["BP3","Install Urban Leading Pedestrian or Bicycle Interval at Signalized Intersection","BP3: Install Urban Leading Pedestrian or Bicycle Interval at Signalized Intersection","P & B","All",10,"Signalized   ","Urban",0.37]
["BP4","Install No Pedestrian Phase Feature with Flashing Yellow Arrow","BP4: Install No Pedestrian Phase Feature with Flashing Yellow Arrow","Pedestrian","All",20,"Signalized   ","Either",0.43]
["BP5","Reduce Right Turn Permissive Conflicts (right turn arrow)","BP5: Reduce Right Turn Permissive Conflicts (right turn arrow)","P & B","All","20","Signalized   ","Either",0.2]
["BP6","Install Urban Green Bike Lanes at Conflict Points","BP6: Install Urban Green Bike Lanes at Conflict Points","Bicycle","All",10,"Signalized or Unsignalized","Urban",0.39]
["BP7","Install Bike Box at Conflict Points","BP7: Install Bike Box at Conflict Points","Bicycle","All",10,"Signalized   ","Either",0.35]
["BP8","Install Pedestrian Refuge Island","BP8: Install Pedestrian Refuge Island","Pedestrian","All",20,"None - Roadway","Either",0.31]
["BP9","Install Rectangular Rapid Flashing Beacon (2-Lane Road)","BP9: Install Rectangular Rapid Flashing Beacon (2-Lane Road)","Pedestrian","All",20,"None - Roadway","Either",0.1]
{"$rows_left_out":22}