{"text_format":"1","workbook":"xlsx","n_sheets":7,"sheets":["START","USER INSTRUCTIONS","DATA ENTRY DASHBOARD","CALCULATOR NEW SOURCES  ","CALCULATOR EXISTING SOURCES","NwSoTransfer","ExSoTransfer"],"not_rendered":{"charts":0,"images":6,"macros":1,"external_links":0,"defined_names":2,"comments":1,"pivot_tables":0},"unopened":[],"bounds":{"document_bytes":16777216,"sheet_cells":100000,"rows_first":2000,"rows_last":500,"rows_between":2000,"halvings":0,"cell_chars":16384,"cell_head_chars":4096},"cells_cut":0,"cells_raw":0,"read":"whole","date_system":"1900"}

{"sheet":"START","index":0,"n_rows":16,"n_cols":4,"rows_kept":16,"cut":false,"hidden":false,"merged":[]}
[]
[]
[]
[]
[]
[]
[]
[]
{"$rows_left_out":9}
{"sheet":"USER INSTRUCTIONS","index":1,"n_rows":134,"n_cols":54,"rows_kept":134,"cut":false,"hidden":true,"merged":[[6,2,6,9],[69,3,69,19],[6,10,6,11],[133,0,133,14]]}
[null,null,null,null,null,null,null,null,null,null,null,null,null,null,null,null,null,null,null,null,null,null,null,null,null,null,null,null,null,null,null,null,null,null,null,null,null,null,null,null,null,null,null,null,null,null,null,null,null,null,null,null,null,"seafood"]
[null,"State of Oregon Department of Environmental Quality"]
[null,"900-J Seafood Processing General Permit: Compliance Calculator"]
[null,null,null,null,null,null,null,null,null,null,null,"Last updated by Erich Brandstetter"]
[null,null,null,null,null,null,null,null,null,null,null,"2021-10-06"]
[]
[null,null,"USER INSTRUCTIONS"]
[null,"GENERAL GUIDELINES"]
{"$rows_left_out":127}
{"sheet":"DATA ENTRY DASHBOARD","index":2,"n_rows":158,"n_cols":35,"rows_kept":158,"cut":false,"hidden":true,"merged":[[0,1,2,9],[0,10,2,12],[18,32,18,39],[19,32,19,39],[15,32,15,39],[3,33,8,34],[14,31,14,39],[16,32,16,39],[17,32,17,39],[41,1,41,8],[38,2,39,13],[30,6,31,6],[32,7,32,8],[22,1,23,1],[24,1,25,1],[26,1,27,1],[28,1,29,1],[30,7,31,7],[72,1,72,8],[73,1,73,8],[74,1,74,8],[75,1,75,8],[70,5,70,8],[71,5,71,8],[70,1,70,4],[71,1,71,4],[67,5,67,8],[68,5,68,8],[69,5,69,8],[53,5,53,8],[54,5,54,8],[55,5,55,8],[56,5,56,8],[57,5,57,8],[62,5,62,8],[63,5,63,8],[64,5,64,8],[65,5,65,8],[66,5,66,8],[42,5,42,8],[43,5,43,8],[44,5,44,8],[45,5,45,8],[46,5,46,8],[47,5,47,8],[48,5,48,8],[49,5,49,8],[50,5,50,8],[51,5,51,8],[52,5,52,8],[58,5,58,8],[59,5,59,8],[61,5,61,8],[65,1,65,4],[54,1,54,4],[55,1,55,4],[56,1,56,4],[57,1,57,4],[58,1,58,4],[60,5,60,8],[67,1,67,4],[68,1,68,4],[69,1,69,4],[59,1,59,4],[61,1,61,4],[62,1,62,4],[63,1,63,4],[64,1,64,4],[60,1,60,4],[50,1,50,4],[51,1,51,4],[52,1,52,4],[53,1,53,4],[66,1,66,4],[45,1,45,4],[46,1,46,4],[47,1,47,4],[48,1,48,4],[49,1,49,4],[42,11,47,12],[48,11,50,11],[48,12,50,12],[20,1,21,1],[4,1,5,1],[4,2,4,3],[5,2,5,3],[8,1,9,1],[10,1,11,1],[12,1,13,1],[14,1,15,1],[16,1,17,1],[18,1,19,1],[42,1,42,4],[43,1,43,4],[44,1,44,4]]}
[null,"↓↓↓    ALL DATA ENTRY GOES HERE      ↓↓↓",null,null,null,null,null,null,null,null,"You must select either \"New Source\" or \"Existing Source\" below."]
[]
[]
[1,"B","C","D","E","F","G","H","I","J","K","L","M","N","O","P","Q","R","S","T","U","V","W","X","Y","Z","←These are the column designations used in cell formulas",null,null,null,null,null,null,"Note: these two species/process types only pertain to Existing Sources; not to New Sources.                                        For Existing Sources Fish Meal Subpart O comes as\"with solubles plant\" or \"with NO solubles plant\".   Canned Sardines Subpart AB comes as \"Dry Transport\" or as \"FLUMED\"."]
[2,1,"USE WHITE SPACES ONLY:    Source Name",null,"Monitoring Month","Year","County","EPA ID","OREGON Permit No.","DEQ File No.","New  or   Existing  Source","Monitoring Tier","EPA ICIS  Source No."]
[3,null,null,null,null,null,null,"ORG 523508","900-J",null,"Existing Source","-"]
[4]
[5]
{"$rows_left_out":151}
{"sheet":"CALCULATOR NEW SOURCES  ","index":3,"n_rows":340,"n_cols":37,"rows_kept":340,"cut":false,"hidden":true,"merged":[[23,1,24,1],[25,1,26,1],[16,29,16,35],[11,1,12,1],[13,1,14,1],[15,1,16,1],[17,1,18,1],[19,1,20,1],[18,29,18,35],[19,29,19,35],[15,29,15,35],[14,28,14,35],[21,1,22,1],[9,1,10,1],[1,1,2,1],[1,2,1,3],[2,2,2,3],[7,1,8,1],[43,10,43,13],[49,11,51,16],[28,6,28,7],[74,25,74,36],[67,12,67,18],[74,13,74,24],[74,2,74,12],[65,10,65,13],[67,2,67,11],[54,10,54,13],[31,2,31,7],[201,4,201,5],[180,4,180,5],[159,4,159,5],[138,4,138,5],[117,4,117,5],[289,2,289,11],[289,12,289,18],[264,4,264,5],[222,4,222,5],[243,4,243,5],[292,26,296,33],[298,2,298,12],[298,13,298,24],[298,25,298,36],[320,1,321,1],[320,2,320,19]]}
[1,"B","C","D","E","F","G","H","I","J","K","L","M","N","O","P","Q","R","S","T","U","V","W","X","Y","Z","AA","AB","AC","AD","AE","AF","AG","AH","AI","AJ"]
[2,1," Source Name",null,"Monitoring Month","Year","County","EPA ID","OREGON      Permit No.","DEQ File No.","New  or   Existing","Monitoring Tier","EPA ICIS  Source No."]
[3,null,{"$f":"'DATA ENTRY DASHBOARD'!C6:D6","v":0},null,{"$f":"'DATA ENTRY DASHBOARD'!E6","v":0},{"$f":"'DATA ENTRY DASHBOARD'!F6","v":0},{"$f":"'DATA ENTRY DASHBOARD'!G6","v":0},"ORG523508",{"$f":"'DATA ENTRY DASHBOARD'!I6","v":"900-J"},{"$f":"'DATA ENTRY DASHBOARD'!J6","v":0},{"$f":"'DATA ENTRY DASHBOARD'!K6","v":"Existing Source"},{"$f":"'DATA ENTRY DASHBOARD'!L6","v":"-"},{"$f":"IF('DATA ENTRY DASHBOARD'!M6=\"\",\"\",('DATA ENTRY DASHBOARD'!M6))","v":""}]
[4]
[5,"B","C","D","E","F","G","H","I","J","K","L","M","N","O","P","Q","R","S","T","U","V","W","X","Y","Z"]
[6]
[7,2,"SAMPLE DATE","GALLONS discharged     MGD                 (MGD = million gallons daily)","BOD5 RESULTS    mg/L                          (mg/L = milligrams per Liter (lab result)","TSS RESULTS    mg/L","O &G RESULTS    mg/L","TOTAL POUNDS PROCESSED for the DAY      Summed across Pounds Columns",null,"H                                             CRAB                                                                        POUNDS","K                                      N. SHRIMP                           POUNDS","U                                  BFC        BOTTOM FISH CONV                      POUNDS","V                         BFM           BOTTOM FISH MECH        POUNDS","R                                     SALMON HB                            POUNDS"," S                                    SALMON MECH                               POUNDS","BPJ               WHOLE FROZEN RAW SHRIMP                 POUNDS","AF                        HERRING  FILLET    (sardines steaked)                        POUNDS","Y                                      OYSTER HAND SHUCK                      POUNDS","O                            FISH MEAL                              POUNDS"," W                      CLAM                  HAND SHUCK                             POUNDS","X                         CLAM                        MECH                               POUNDS","M              BREADED SHRIMP CONTIGUOUS STATES              POUNDS","N                                  TUNA    (canned)                    POUNDS","AA                                      OYSTER  STEAMED & CANNED                 POUNDS","AB                                  SARDINES                      (CANNED)                     POUNDS","AD                             SCALLOP                 POUNDS"]
[8,"Sample Day 1",{"$f":"'DATA ENTRY DASHBOARD'!$C$11","v":"00:00:00"},{"$f":"IF('DATA ENTRY DASHBOARD'!$D$11=\"\",\"\",('DATA ENTRY DASHBOARD'!$D$11))","v":""},{"$f":"IF('DATA ENTRY DASHBOARD'!$E$11=\"\",\"\",('DATA ENTRY DASHBOARD'!$E$11))","v":""},{"$f":"IF('DATA ENTRY DASHBOARD'!$F$11=\"\",\"\",('DATA ENTRY DASHBOARD'!$F$11))","v":""},{"$f":"IF('DATA ENTRY DASHBOARD'!$G$11=\"\",\"\",('DATA ENTRY DASHBOARD'!$G$11))","v":""},{"$f":"SUM(J8:Z8)","v":0},null,{"$f":"IF('DATA ENTRY DASHBOARD'!$J$11=\"\",0, ('DATA ENTRY DASHBOARD'!$J$11))","v":0},{"$f":"IF('DATA ENTRY DASHBOARD'!$K$11=\"\",0, ('DATA ENTRY DASHBOARD'!$K$11))","v":0},{"$f":"IF('DATA ENTRY DASHBOARD'!$L$11=\"\",0, ('DATA ENTRY DASHBOARD'!$L$11))","v":0},{"$f":"IF('DATA ENTRY DASHBOARD'!$M$11=\"\",0, ('DATA ENTRY DASHBOARD'!$M$11))","v":0},{"$f":"IF('DATA ENTRY DASHBOARD'!$N$11=\"\",0, ('DATA ENTRY DASHBOARD'!$N$11))","v":0},{"$f":"IF('DATA ENTRY DASHBOARD'!$O$11=\"\",0, ('DATA ENTRY DASHBOARD'!$O$11))","v":0},{"$f":"IF('DATA ENTRY DASHBOARD'!$P$11=\"\",0, ('DATA ENTRY DASHBOARD'!$P$11))","v":0},{"$f":"IF('DATA ENTRY DASHBOARD'!$Q$11=\"\",0, ('DATA ENTRY DASHBOARD'!$Q$11))","v":0},{"$f":"IF('DATA ENTRY DASHBOARD'!$R$11=\"\",0, ('DATA ENTRY DASHBOARD'!$R$11))","v":0},{"$f":"IF('DATA ENTRY DASHBOARD'!$S$11=\"\",0, ('DATA ENTRY DASHBOARD'!$S$11))","v":0},{"$f":"IF('DATA ENTRY DASHBOARD'!$T$11=\"\",0, ('DATA ENTRY DASHBOARD'!$T$11))","v":0},{"$f":"IF('DATA ENTRY DASHBOARD'!$U$11=\"\",0, ('DATA ENTRY DASHBOARD'!$U$11))","v":0},{"$f":"IF('DATA ENTRY DASHBOARD'!$V$11=\"\",0, ('DATA ENTRY DASHBOARD'!$V$11))","v":0},{"$f":"IF('DATA ENTRY DASHBOARD'!$W$11=\"\",0, ('DATA ENTRY DASHBOARD'!$W$11))","v":0},{"$f":"IF('DATA ENTRY DASHBOARD'!$X$11=\"\",0, ('DATA ENTRY DASHBOARD'!$X$11))","v":0},{"$f":"IF('DATA ENTRY DASHBOARD'!$Y$11=\"\",0, ('DATA ENTRY DASHBOARD'!$Y$11))","v":0},{"$f":"IF('DATA ENTRY DASHBOARD'!$Z$11=\"\",0, ('DATA ENTRY DASHBOARD'!$Z$11))","v":0}]
{"$rows_left_out":333}
{"sheet":"CALCULATOR EXISTING SOURCES","index":4,"n_rows":360,"n_cols":37,"rows_kept":360,"cut":false,"hidden":true,"merged":[[11,1,12,1],[13,1,14,1],[15,1,16,1],[17,1,18,1],[2,31,6,32],[9,1,10,1],[1,1,2,1],[1,2,1,3],[2,2,2,3],[7,1,8,1],[7,31,10,31],[7,32,10,32],[13,29,13,36],[14,30,14,36],[15,30,15,36],[16,30,16,36],[19,1,20,1],[21,1,22,1],[23,1,24,1],[25,1,26,1],[49,11,51,16],[31,2,31,7],[17,30,17,36],[18,30,18,36],[144,4,144,5],[167,4,167,5],[213,4,213,5],[190,4,190,5],[67,2,67,11],[121,4,121,5],[67,12,67,20],[74,25,74,36],[74,13,74,24],[74,2,74,12],[318,25,318,36],[259,4,259,5],[342,1,343,1],[236,4,236,5],[309,12,309,20],[318,13,318,24],[318,2,318,12],[282,4,282,5],[309,2,309,11],[342,2,342,19]]}
[1,"B","C","D","E","F","G","H","I","J","K","L","M","N","O","P","Q","R","S","T","U","V","W","X","Y","Z","AA","AB","AC","AD","AE","AF","AG","AH","AI","AJ"]
[2,1," Source Name",null,"Monitoring Month","Year","County","EPA ID","OREGON      Permit No.","DEQ File No.","New  or   Existing","Monitoring Tier","EPA ICIS  Source No."]
[3,null,{"$f":"'DATA ENTRY DASHBOARD'!C6:D6","v":0},null,{"$f":"'DATA ENTRY DASHBOARD'!E6","v":0},{"$f":"'DATA ENTRY DASHBOARD'!F6","v":0},{"$f":"'DATA ENTRY DASHBOARD'!G6","v":0},"ORG523508",{"$f":"'DATA ENTRY DASHBOARD'!I6","v":"900-J"},{"$f":"'DATA ENTRY DASHBOARD'!J6","v":0},{"$f":"'DATA ENTRY DASHBOARD'!K6","v":"Existing Source"},{"$f":"'DATA ENTRY DASHBOARD'!L6","v":"-"},{"$f":"IF('DATA ENTRY DASHBOARD'!M6=\"\",\"\",('DATA ENTRY DASHBOARD'!M6))","v":""},null,null,null,null,null,null,null,null,null,null,null,null,null,null,null,null,null,null,"Note: these two species/process types only pertain to Existing sources; not to NEW sources.                                        For Existing sources Fish Meal Subpart O comes as  \"WITH Solubles Plant\" or \"With NO Solubles Plant\".                                Canned Sardines Subpart AB comes as \"Dry Transport\" or as \"FLUMED\"."]
[4]
[5,"B","C","D","E","F","G","H","I","J","K","L","M","N","O","P","Q","R","S","T","U","V","W","X","Y","Z","AA","AB"]
[6]
[7,2,"DATE HERE","GALLONS discharged                    MGD","BOD5 RESULTS    mg/L","TSS RESULTS    mg/L","O &G RESULTS    mg/L","TOTAL POUNDS PROCESSED for the DAY                                Summed across Pounds Columns",null,"H                                             CRAB","K                                      N. SHRIMP","U                                  BFC                    BOTTOM FISH CONV","V                                           BFM                    BOTTOM FISH MECH","R                                     SALMON HB"," S                                    SALMON MECH","BPJ                                     WHOLE FROZEN RAW SHRIMP","AF                        HERRING  FILLET    (sardines steaked)","Y                                      OYSTER HAND SHUCK","O                            FISH MEAL                  WITH             SOLUBLES  PLANT","O                            FISH MEAL           NO               SOLUBLES  PLANT "," W                      CLAM                  HAND SHUCK","X                         CLAM                        MECH","M                                 BREADED SHRIMP CONTIGUOUS STATES","N                                  TUNA                  (canned)","AA                                      OYSTER  STEAMED & CANNED","AB                                  SARDINES                      (CANNED)                       DRY  TRANSPORT","AB                                  SARDINES                      (CANNED)                    FLUME","AD                             SCALLOP"]
[8,"Sample Day 1",{"$f":"'DATA ENTRY DASHBOARD'!$C$11","v":"00:00:00"},{"$f":"IF('DATA ENTRY DASHBOARD'!$D$11=\"\",\"\", ('DATA ENTRY DASHBOARD'!$D$11))","v":""},{"$f":"IF('DATA ENTRY DASHBOARD'!$E$11=\"\",\"\", ('DATA ENTRY DASHBOARD'!$E$11))","v":""},{"$f":"IF('DATA ENTRY DASHBOARD'!$F$11=\"\",\"\", ('DATA ENTRY DASHBOARD'!$F$11))","v":""},{"$f":"IF('DATA ENTRY DASHBOARD'!$G$11=\"\",\"\", ('DATA ENTRY DASHBOARD'!$G$11))","v":""},{"$f":"SUM(J8:AB8)","v":0},null,{"$f":"IF('DATA ENTRY DASHBOARD'!$J$11=\"\",0, ('DATA ENTRY DASHBOARD'!$J$11))","v":0},{"$f":"IF('DATA ENTRY DASHBOARD'!$K$11=\"\",0, ('DATA ENTRY DASHBOARD'!$K$11))","v":0},{"$f":"IF('DATA ENTRY DASHBOARD'!$L$11=\"\",0, ('DATA ENTRY DASHBOARD'!$L$11))","v":0},{"$f":"IF('DATA ENTRY DASHBOARD'!$M$11=\"\",0, ('DATA ENTRY DASHBOARD'!$M$11))","v":0},{"$f":"IF('DATA ENTRY DASHBOARD'!$N$11=\"\",0, ('DATA ENTRY DASHBOARD'!$N$11))","v":0},{"$f":"IF('DATA ENTRY DASHBOARD'!$O$11=\"\",0, ('DATA ENTRY DASHBOARD'!$O$11))","v":0},{"$f":"IF('DATA ENTRY DASHBOARD'!$P$11=\"\",0, ('DATA ENTRY DASHBOARD'!$P$11))","v":0},{"$f":"IF('DATA ENTRY DASHBOARD'!$Q$11=\"\",0, ('DATA ENTRY DASHBOARD'!$Q$11))","v":0},{"$f":"IF('DATA ENTRY DASHBOARD'!$R$11=\"\",0, ('DATA ENTRY DASHBOARD'!$R$11))","v":0},{"$f":"IF('DATA ENTRY DASHBOARD'!$S$11=\"\",0, ('DATA ENTRY DASHBOARD'!$S$11))","v":0},{"$f":"IF('DATA ENTRY DASHBOARD'!$AA$11=\"\",0, ('DATA ENTRY DASHBOARD'!$AA$11))","v":0},{"$f":"IF('DATA ENTRY DASHBOARD'!$T$11=\"\",0, ('DATA ENTRY DASHBOARD'!$T$11))","v":0},{"$f":"IF('DATA ENTRY DASHBOARD'!$U$11=\"\",0, ('DATA ENTRY DASHBOARD'!$U$11))","v":0},{"$f":"IF('DATA ENTRY DASHBOARD'!$V$11=\"\",0, ('DATA ENTRY DASHBOARD'!$V$11))","v":0},{"$f":"IF('DATA ENTRY DASHBOARD'!$W$11=\"\",0, ('DATA ENTRY DASHBOARD'!$W$11))","v":0},{"$f":"IF('DATA ENTRY DASHBOARD'!$X$11=\"\",0, ('DATA ENTRY DASHBOARD'!$X$11))","v":0},{"$f":"IF('DATA ENTRY DASHBOARD'!$Y$11=\"\",0, ('DATA ENTRY DASHBOARD'!$Y$11))","v":0},{"$f":"IF('DATA ENTRY DASHBOARD'!$AB$11=\"\",0, ('DATA ENTRY DASHBOARD'!$AB$11))","v":0},{"$f":"IF('DATA ENTRY DASHBOARD'!$Z$11=\"\",0, ('DATA ENTRY DASHBOARD'!$Z$11))","v":0},null,null,null,"O                            FISH MEAL           NO               SOLUBLES  PLANT ","AB                                  SARDINES                      (CANNED)                    FLUME"]
{"$rows_left_out":353}
{"sheet":"NwSoTransfer","index":5,"n_rows":29,"n_cols":10,"rows_kept":29,"cut":false,"hidden":true,"merged":[]}
["Day",{"$f":"'CALCULATOR NEW SOURCES  '!K77","v":"Total Load #/1000-#"},{"$f":"'CALCULATOR NEW SOURCES  '!L77","v":"TSS Daily Max TBEL                        #/1000-#"},{"$f":"'CALCULATOR NEW SOURCES  '!M77","v":"Compliance               YES /NO"},{"$f":"'CALCULATOR NEW SOURCES  '!W77","v":"Total Load #/1000-#"},{"$f":"'CALCULATOR NEW SOURCES  '!X77","v":"TSS Daily Max TBEL                        #/1000-#"},{"$f":"'CALCULATOR NEW SOURCES  '!Y77","v":"Compliance              YES/ NO"},{"$f":"'CALCULATOR NEW SOURCES  '!AI77","v":"Total Load #/1000-#"},{"$f":"'CALCULATOR NEW SOURCES  '!AJ77","v":"TSS Daily Max TBEL                        #/1000-#"},{"$f":"'CALCULATOR NEW SOURCES  '!AK77","v":"Compliance                  YES / NO"}]
[1,{"$f":"'CALCULATOR NEW SOURCES  '!K78","v":0},{"$f":"'CALCULATOR NEW SOURCES  '!L78","v":""},{"$f":"'CALCULATOR NEW SOURCES  '!M78","v":""},{"$f":"'CALCULATOR NEW SOURCES  '!W78","v":0},{"$f":"'CALCULATOR NEW SOURCES  '!X78","v":""},{"$f":"'CALCULATOR NEW SOURCES  '!Y78","v":""},{"$f":"'CALCULATOR NEW SOURCES  '!AI78","v":0},{"$f":"'CALCULATOR NEW SOURCES  '!AJ78","v":""},{"$f":"'CALCULATOR NEW SOURCES  '!AK78","v":""}]
[{"$f":"1+A2","v":2},{"$f":"'CALCULATOR NEW SOURCES  '!K99","v":0},{"$f":"'CALCULATOR NEW SOURCES  '!L99","v":""},{"$f":"'CALCULATOR NEW SOURCES  '!M99","v":""},{"$f":"'CALCULATOR NEW SOURCES  '!W99","v":0},{"$f":"'CALCULATOR NEW SOURCES  '!X99","v":""},{"$f":"'CALCULATOR NEW SOURCES  '!Y99","v":""},{"$f":"'CALCULATOR NEW SOURCES  '!AI99","v":0},{"$f":"'CALCULATOR NEW SOURCES  '!AJ99","v":""},{"$f":"'CALCULATOR NEW SOURCES  '!AK99","v":""}]
[{"$f":"1+A3","v":3},{"$f":"'CALCULATOR NEW SOURCES  '!K120","v":0},{"$f":"'CALCULATOR NEW SOURCES  '!L120","v":""},{"$f":"'CALCULATOR NEW SOURCES  '!M120","v":""},{"$f":"'CALCULATOR NEW SOURCES  '!W120","v":0},{"$f":"'CALCULATOR NEW SOURCES  '!X120","v":""},{"$f":"'CALCULATOR NEW SOURCES  '!Y120","v":""},{"$f":"'CALCULATOR NEW SOURCES  '!AI120","v":0},{"$f":"'CALCULATOR NEW SOURCES  '!AJ120","v":""},{"$f":"'CALCULATOR NEW SOURCES  '!AK120","v":""}]
[4,{"$f":"'CALCULATOR NEW SOURCES  '!K141","v":0},{"$f":"'CALCULATOR NEW SOURCES  '!L141","v":""},{"$f":"'CALCULATOR NEW SOURCES  '!M141","v":""},{"$f":"'CALCULATOR NEW SOURCES  '!W141","v":0},{"$f":"'CALCULATOR NEW SOURCES  '!X141","v":""},{"$f":"'CALCULATOR NEW SOURCES  '!Y141","v":""},{"$f":"'CALCULATOR NEW SOURCES  '!AI141","v":0},{"$f":"'CALCULATOR NEW SOURCES  '!AJ141","v":""},{"$f":"'CALCULATOR NEW SOURCES  '!AK141","v":""}]
[5,{"$f":"'CALCULATOR NEW SOURCES  '!K162","v":0},{"$f":"'CALCULATOR NEW SOURCES  '!L162","v":""},{"$f":"'CALCULATOR NEW SOURCES  '!M162","v":""},{"$f":"'CALCULATOR NEW SOURCES  '!W162","v":0},{"$f":"'CALCULATOR NEW SOURCES  '!X162","v":""},{"$f":"'CALCULATOR NEW SOURCES  '!Y162","v":""},{"$f":"'CALCULATOR NEW SOURCES  '!AI162","v":0},{"$f":"'CALCULATOR NEW SOURCES  '!AJ162","v":""},{"$f":"'CALCULATOR NEW SOURCES  '!AK162","v":""}]
[6,{"$f":"'CALCULATOR NEW SOURCES  '!K183","v":0},{"$f":"'CALCULATOR NEW SOURCES  '!L183","v":""},{"$f":"'CALCULATOR NEW SOURCES  '!M183","v":""},{"$f":"'CALCULATOR NEW SOURCES  '!W183","v":0},{"$f":"'CALCULATOR NEW SOURCES  '!X183","v":""},{"$f":"'CALCULATOR NEW SOURCES  '!Y183","v":""},{"$f":"'CALCULATOR NEW SOURCES  '!AI183","v":0},{"$f":"'CALCULATOR NEW SOURCES  '!AJ183","v":""},{"$f":"'CALCULATOR NEW SOURCES  '!AK183","v":""}]
[7,{"$f":"'CALCULATOR NEW SOURCES  '!K204","v":0},{"$f":"'CALCULATOR NEW SOURCES  '!L204","v":""},{"$f":"'CALCULATOR NEW SOURCES  '!M204","v":""},{"$f":"'CALCULATOR NEW SOURCES  '!W204","v":0},{"$f":"'CALCULATOR NEW SOURCES  '!X204","v":""},{"$f":"'CALCULATOR NEW SOURCES  '!Y204","v":""},{"$f":"'CALCULATOR NEW SOURCES  '!AI204","v":0},{"$f":"'CALCULATOR NEW SOURCES  '!AJ204","v":""},{"$f":"'CALCULATOR NEW SOURCES  '!AK204","v":""}]
{"$rows_left_out":22}
{"sheet":"ExSoTransfer","index":6,"n_rows":13,"n_cols":11,"rows_kept":13,"cut":false,"hidden":true,"merged":[]}
[null,"Day",{"$f":"'CALCULATOR EXISTING SOURCES'!K77","v":"Total Load #/1000-#"},{"$f":"'CALCULATOR EXISTING SOURCES'!L77","v":"BOD Daily Max TBEL                        #/1000-#"},{"$f":"'CALCULATOR EXISTING SOURCES'!M77","v":"Compliance                  YES /NO"},{"$f":"'CALCULATOR EXISTING SOURCES'!W77","v":"Total Load #/1000-#"},{"$f":"'CALCULATOR EXISTING SOURCES'!X77","v":"TSS Daily Max TBEL                        #/1000-#"},{"$f":"'CALCULATOR EXISTING SOURCES'!Y77","v":"Compliance                 YES/ NO"},{"$f":"'CALCULATOR EXISTING SOURCES'!AI77","v":"Total Load #/1000-#"},{"$f":"'CALCULATOR EXISTING SOURCES'!AJ77","v":"O&G Daily Max TBEL                        #/1000-#"},{"$f":"'CALCULATOR EXISTING SOURCES'!AK77","v":"Compliance     YES / NO"}]
[null,1,{"$f":"'CALCULATOR EXISTING SOURCES'!K78","v":0},{"$f":"'CALCULATOR EXISTING SOURCES'!L78","v":""},{"$f":"'CALCULATOR EXISTING SOURCES'!M78","v":""},{"$f":"'CALCULATOR EXISTING SOURCES'!W78","v":0},{"$f":"'CALCULATOR EXISTING SOURCES'!X78","v":""},{"$f":"'CALCULATOR EXISTING SOURCES'!Y78","v":""},{"$f":"'CALCULATOR EXISTING SOURCES'!AI78","v":0},{"$f":"'CALCULATOR EXISTING SOURCES'!AJ78","v":""},{"$f":"'CALCULATOR EXISTING SOURCES'!AK78","v":""}]
[null,{"$f":"1+B2","v":2},{"$f":"'CALCULATOR EXISTING SOURCES'!K101","v":0},{"$f":"'CALCULATOR EXISTING SOURCES'!L101","v":""},{"$f":"'CALCULATOR EXISTING SOURCES'!M101","v":""},{"$f":"'CALCULATOR EXISTING SOURCES'!W101","v":0},{"$f":"'CALCULATOR EXISTING SOURCES'!X101","v":""},{"$f":"'CALCULATOR EXISTING SOURCES'!Y101","v":""},{"$f":"'CALCULATOR EXISTING SOURCES'!AI101","v":0},{"$f":"'CALCULATOR EXISTING SOURCES'!AJ101","v":""},{"$f":"'CALCULATOR EXISTING SOURCES'!AK101","v":""}]
[null,{"$f":"1+B3","v":3},{"$f":"'CALCULATOR EXISTING SOURCES'!K124","v":0},{"$f":"'CALCULATOR EXISTING SOURCES'!L124","v":""},{"$f":"'CALCULATOR EXISTING SOURCES'!M124","v":""},{"$f":"'CALCULATOR EXISTING SOURCES'!W124","v":0},{"$f":"'CALCULATOR EXISTING SOURCES'!X124","v":""},{"$f":"'CALCULATOR EXISTING SOURCES'!Y124","v":""},{"$f":"'CALCULATOR EXISTING SOURCES'!AI124","v":0},{"$f":"'CALCULATOR EXISTING SOURCES'!AJ124","v":""},{"$f":"'CALCULATOR EXISTING SOURCES'!AK124","v":""}]
[null,4,{"$f":"'CALCULATOR EXISTING SOURCES'!K147","v":0},{"$f":"'CALCULATOR EXISTING SOURCES'!L147","v":""},{"$f":"'CALCULATOR EXISTING SOURCES'!M147","v":""},{"$f":"'CALCULATOR EXISTING SOURCES'!W147","v":0},{"$f":"'CALCULATOR EXISTING SOURCES'!X147","v":""},{"$f":"'CALCULATOR EXISTING SOURCES'!Y147","v":""},{"$f":"'CALCULATOR EXISTING SOURCES'!AI147","v":0},{"$f":"'CALCULATOR EXISTING SOURCES'!AJ147","v":""},{"$f":"'CALCULATOR EXISTING SOURCES'!AK147","v":""}]
[null,5,{"$f":"'CALCULATOR EXISTING SOURCES'!K170","v":0},{"$f":"'CALCULATOR EXISTING SOURCES'!L170","v":""},{"$f":"'CALCULATOR EXISTING SOURCES'!M170","v":""},{"$f":"'CALCULATOR EXISTING SOURCES'!W170","v":0},{"$f":"'CALCULATOR EXISTING SOURCES'!X170","v":""},{"$f":"'CALCULATOR EXISTING SOURCES'!Y170","v":""},{"$f":"'CALCULATOR EXISTING SOURCES'!AI170","v":0},{"$f":"'CALCULATOR EXISTING SOURCES'!AJ170","v":""},{"$f":"'CALCULATOR EXISTING SOURCES'!AK170","v":""}]
[null,6,{"$f":"'CALCULATOR EXISTING SOURCES'!K193","v":0},{"$f":"'CALCULATOR EXISTING SOURCES'!L193","v":""},{"$f":"'CALCULATOR EXISTING SOURCES'!M193","v":""},{"$f":"'CALCULATOR EXISTING SOURCES'!W193","v":0},{"$f":"'CALCULATOR EXISTING SOURCES'!X193","v":""},{"$f":"'CALCULATOR EXISTING SOURCES'!Y193","v":""},{"$f":"'CALCULATOR EXISTING SOURCES'!AI193","v":0},{"$f":"'CALCULATOR EXISTING SOURCES'!AJ193","v":""},{"$f":"'CALCULATOR EXISTING SOURCES'!AK193","v":""}]
[null,7,{"$f":"'CALCULATOR EXISTING SOURCES'!K216","v":0},{"$f":"'CALCULATOR EXISTING SOURCES'!L216","v":""},{"$f":"'CALCULATOR EXISTING SOURCES'!M216","v":""},{"$f":"'CALCULATOR EXISTING SOURCES'!W216","v":0},{"$f":"'CALCULATOR EXISTING SOURCES'!X216","v":""},{"$f":"'CALCULATOR EXISTING SOURCES'!Y216","v":""},{"$f":"'CALCULATOR EXISTING SOURCES'!AI216","v":0},{"$f":"'CALCULATOR EXISTING SOURCES'!AJ216","v":""},{"$f":"'CALCULATOR EXISTING SOURCES'!AK216","v":""}]
{"$rows_left_out":5}