{"text_format":"1","workbook":"xlsx","n_sheets":8,"sheets":["Introduction","Site-Specific Inputs","Calculated Parameters","Pathway Summary","OR-GREET4.0","EF Tables","EF General","Old Fuel_Specs"],"not_rendered":{"charts":0,"images":2,"macros":1,"external_links":6,"defined_names":236,"comments":4,"pivot_tables":0},"unopened":[],"bounds":{"document_bytes":16777216,"sheet_cells":100000,"rows_first":2000,"rows_last":500,"rows_between":2000,"halvings":0,"cell_chars":16384,"cell_head_chars":4096},"cells_cut":0,"cells_raw":0,"read":"whole","date_system":"1900"}

{"sheet":"Introduction","index":0,"n_rows":44,"n_cols":6,"rows_kept":44,"cut":false,"hidden":false,"merged":[[2,2,2,6],[3,2,3,6]]}
[]
[null,null,null,null,null,{"$error":"#VALUE!"}]
[null,null,"Low Carbon Fuel Standard\nTier 1 CI Calculator for Sugarcane Ethanol (Release Date: 08/12/2024)"]
[null,null,"The Tier 1 Calculator for Sugarcane Ethanol (T1 Sugarcane Calculator) offers a simplified interface for calculating the carbon intensity of sugarcane-derived ethanol produced from sugarcane juice or molasses feedstocks. \n\nTo begin, navigate to the \"Site-Specific Inputs\" worksheet and enter all relevant project data. For Tier 1 pathways, a minimum of 3 months of operational data is required. Inputs entered by the applicant are limited to all yellow cells (see Color Key below). Inputs that do not apply to the fuel pathway may be left blank. Cells containing calculated or predefined input values may not be modified without DEQ approval via a Tier 2 pathway. \n\nCarbon Intensity (CI) results are provided on the \"Pathway Summary\" worksheet, along with calculated input results and finished fuel quantities. Pathway-specific Operating Conditions that may be added by DEQ prior to pathway certification.\n\nThe \"Predefined Inputs\" worksheet contains input values, emission factors, and unit conversion tables from the Argonne National Labs GREET 2022 model, with additional modeling inputs from EPA eGRID,  CARB EMFAC,  Purdue University GTAP, Stanford OPGEE, and the CFP pathway database.\n\nThe \"Calculated Parameters\" contains additional calculations to determine the upstream impacts (Mass Allocation Ratio) of Sugarcane Farming and Transport on the production of sugarcane molasses (a by-product of the Table Sugar production process) used for ethanol production.  This model also permits the applicant to model the theoretical output of finished table sugar and ethanol produced, and compare it to the reported output of table sugar and ethanol produced.                                                                                                                                                                                                                                                                                                                                                                                                                                                           \n\nAdditional Notes: In order for macros to function properly, the \"Enable Content\" button in Microsoft Excel must be selected upon opening this calculator. In order to ensure that CI calculations reflect the most recent inputs, select \"Automatic\" calculations from the \"Calculation Options\" in the \"Formulas\" toolbar or press F9 (if using Microsoft Excel)."]
[null,null,null,"Color Key",null,"CFP Website Resources"]
[null,null,null,"User Input",null,"CFP Program Overview"]
[null,null,null,"Calculated Value",null,"Tier 1 Pathway Calculators and Instruction Manuals"]
[null,null,null,"OR-GREET4.0 Input",null,"Tier 1 Pathway Application Process"]
[]
[]
{"$rows_left_out":35}
{"sheet":"Site-Specific Inputs","index":1,"n_rows":57,"n_cols":56,"rows_kept":57,"cut":false,"hidden":false,"merged":[[38,5,38,6],[39,5,39,6],[2,15,2,16],[1,1,1,2],[8,1,8,2],[1,4,1,26],[2,17,2,18],[5,9,6,9],[5,10,6,10],[5,11,6,11],[5,12,6,12],[5,13,6,13],[5,14,6,14],[5,15,6,15],[5,16,6,16],[5,17,6,17],[2,28,2,31],[2,19,2,26],[2,5,2,10],[24,1,24,2],[2,13,2,14],[2,11,2,12],[10,1,11,1],[12,1,13,1],[15,1,16,1],[17,1,19,1],[5,5,6,5],[5,4,6,4],[5,6,6,6],[5,7,6,7],[5,8,6,8],[5,23,6,23],[5,24,6,24],[5,25,6,25],[5,26,6,26],[5,18,6,18],[5,19,6,19],[5,20,6,20],[5,21,6,21],[5,22,6,22]]}
[]
[null,"Section 1: Applicant Information",null,null,"Section 4: Monthly Operational Data"]
[null,"1.1 Application Number",null,null,null,"Feedstock Parameters",null,null,null,null,null,"Externally-Sourced Feedstock",null,"Externally-Sourced Biomass",null,"Process Energy",null,"Process Parameters",null,"Fuel and Co-Product Production",null,null,null,null,null,null,null,null,"Section 1: Pathway Inputs Selection"]
[null,"1.2 Company Name",null,null,null,"Feedstock Procured","Feedstock Transport","Feedstock Procured","Feedstock Transport","Total Feedstock","Feedstock Transport","External Molasses","Ethanol Produced","External Biomass*","Electricity Cogenerated","Electricity Procured","Electricity Exported"]
[null,"1.3 Company ID",null,null,4.0999999999999996,4.2,4.3,4.4000000000000004,4.5,4.5999999999999996,4.7,4.8,4.9000000000000004,4.0999999999999996,4.1100000000000003,4.12,4.13,4.1399999999999997,4.1500000000000004,4.16,4.17,4.18,4.1900000000000004,4.2,4.21,4.22,4.2300000000000004]
[null,"1.4 Fuel Production Facility Address",null,null,"Reporting Month ","Applicant-Owned Farms (Propria Farms)","Transport Distance from Applicant-Owned Farms (weighted average)","Partnership Farms (Terceiros Farms)","Transport Distance from Partnership Farms (weighted average)","Total Sugarcane Procured (Calculated)","Filter Cake Transport & Distribution Distance (Calculated)","Externally-Sourced Molasses","Ethanol Produced from Externally-Sourced Molasses**","Externally-Sourced Biomass (bagasse equivalents)","Electricity Generated from Externally-Sourced Biomass**","Electricity Purchased from the Public Grid","Surplus Cogenerated Electricity Exported","Juice Share for Sugar Production (weighted average)","Fraction Sucrose Content of Juice (weighted average)","Anhydrous Ethanol Produced","Moisture Content (Anhydrous Ethanol)","Adjusted Anhydrous Ethanol Produced","Hydrous Ethanol Produced","Moisture Content (Hydrous Ethanol)","Adjusted Hydrous Ethanol Produced","Finished or Table Sugar Produced","Total Ethanol Produced"]
[null,"1.5 Facility ID"]
[null,null,null,null,"Month/YYYY","metric tons (tonnes)","km","metric tons (tonnes)","km","metric tons (tonnes)","km","metric tons (tonnes)","m3","metric tons (tonnes)","kWh","kWh","kWh","%","\"0.000\"","m3 (Reported at 20 C/68 F)","%","wet m3","m3 (Reported at 20 C/68 F)","%","wet m3","metric tons (tonnes)","m3, dry basis"]
[null,"Section 2: Pathway Inputs",null,null,null,null,null,null,null,{"$f":"IFERROR(IF((F9+H9)>0,(F9+H9),\"0\"),\"\")","v":"0"},{"$f":"IFERROR(((F9*G9+H9*I9)/J9)+2/AQ$56,\"0\")","v":"0"},null,null,null,{"$f":"IF((N9*('OR-GREET4.0'!E$44-'Calculated Parameters'!$D$156)*'OR-GREET4.0'!E$46*'OR-GREET4.0'!E$47*'OR-GREET4.0'!E$48/kWh2Btu)>0,(N9*('OR-GREET4.0'!E$44-'Calculated Parameters'!$D$156)*'OR-GREET4.0'!E$46*'OR-GREET4.0'!E$47*'OR-GREET4.0'!E$48/kWh2Btu),0)","v":0},null,null,null,null,null,null,{"$f":"IFERROR(IF((T9-M9*$W$34)>0,(T9-M9*$W$34),0),\"0\")","v":"0"},null,null,{"$f":"IFERROR(IF((W9-M9*$Z$34)>0,(W9-M9*$Z$34),0),\"0\")","v":"0"},null,{"$f":"IFERROR(V9*(1-U9)+Y9*(1-X9),\"0\")","v":0}]
[null,"2.1 Pathway CIs","Composite",null,null,null,null,null,null,"0","0",null,null,null,{"$f":"IF((N10*('OR-GREET4.0'!E$44-'Calculated Parameters'!$D$156)*'OR-GREET4.0'!E$46*'OR-GREET4.0'!E$47*'OR-GREET4.0'!E$48/kWh2Btu)>0,(N10*('OR-GREET4.0'!E$44-'Calculated Parameters'!$D$156)*'OR-GREET4.0'!E$46*'OR-GREET4.0'!E$47*'OR-GREET4.0'!E$48/kWh2Btu),0)","v":0},null,null,null,null,null,null,"0",null,null,"0",null,{"$f":"IFERROR(V10*(1-U10)+Y10*(1-X10),\"0\")","v":0}]
{"$rows_left_out":48}
{"sheet":"Calculated Parameters","index":2,"n_rows":167,"n_cols":36,"rows_kept":167,"cut":false,"hidden":false,"merged":[[119,5,120,5],[115,2,115,3],[12,7,12,10],[14,7,14,10],[31,1,31,11],[66,1,66,14],[77,1,77,14],[88,7,88,12],[88,1,88,6],[89,1,89,4],[89,7,89,10],[114,2,114,3],[95,8,95,9],[94,11,95,11],[94,5,95,5],[90,7,90,8],[112,2,112,3],[110,2,110,3],[109,2,109,3],[98,12,99,12],[11,7,11,10],[13,7,13,10],[15,7,15,10],[92,2,92,3],[90,1,90,2],[27,1,27,3],[25,1,25,3],[24,1,24,3],[94,12,95,12],[98,6,99,6],[95,2,95,3],[94,6,95,6],[2,1,2,10],[8,1,8,6],[26,1,26,3],[3,1,3,10],[5,1,5,10],[6,1,6,10],[7,1,7,10],[9,1,9,6],[8,7,8,10],[16,7,16,10],[17,7,17,10],[18,7,18,10],[10,7,10,10],[9,7,9,10],[4,1,4,10],[127,11,128,11],[123,5,124,5],[125,5,126,5],[127,5,128,5],[28,1,28,3],[123,11,124,11],[125,11,126,11],[108,2,108,3],[107,2,107,3],[121,5,122,5],[113,2,113,3],[121,11,122,11],[119,11,120,11],[114,8,114,9],[115,8,115,9],[92,8,92,9]]}
[]
[]
[null,"Section 5:  Calculation of Production Yields and Mass Allocation Ratio "]
[null," Step 5.a:  It is imperative that any previous versions of the Tier 1 Simplified CI Calculator for Sugarcane Ethanol (v.3.0) be closed. Select \"Data\" from the Excel File Menu (Header) above.  Then Click the \"Solver\" icon menu above to the far right of the header.  Ensure that the \"Set Objective\" refers to Cell E27, and is set to a value of 0.0.  See instructions below to install the \"Solver AddIn\" functionality to your current version of Microsoft Excel.    "]
[null,"Step 5.b:  Do not change any of the constraints defined in the window (see Section 5 User Instruction in the Instruction Manual for the Simplified CI Calculator). Then Click the \"Solve\" Button."]
[null,"Step 5.c:  The Solver will go through several iterations to find a solution.  The \"Calculate CI\" may need to be executed repeatedly if the iterations are not automatic until a solution is found.  A new window \"Solver Results\" will open up.  Solver will display the message that a solution has been found.                                                                                                                                                                                   "]
[null,"Step 5.d: Click OK. If a solution has not been found, it is an indication that there is a material imbalance.  Check the \"Site-Specific Inputs\" data for accuracy, then repeat Step 5.a until a solution has been found, and all constraints and optimality conditions have been satisfied.  "]
[null," Step 5.e:  If a solution has not still been found, then check the juice shares (fraction juice allocated to sugar production), and the fraction of sucrose in the cane juice that enters production.  The level of sucrose (eta_j) could be lower due to process losses even if measured higher at the gate or after crush."]
[null,"Gopal-Kammen Model Parameters",null,null,null,null,null,"Instructions to Install \"Solver Add-In\" Functionality to Current Version of Microsoft Excel"]
[null,"Mill-specific values for ethanol yield calculation and ethanol production modeling",null,null,null,null,null,"1.  Click or go to \"File\" in the Header Menu"]
{"$rows_left_out":158}
{"sheet":"Pathway Summary","index":3,"n_rows":51,"n_cols":18,"rows_kept":51,"cut":false,"hidden":false,"merged":[[38,1,38,12],[40,1,40,12],[1,14,1,17],[3,2,4,12],[5,1,5,12],[6,3,9,3],[6,4,6,12],[11,8,11,10],[30,1,32,1],[0,0,41,0],[0,1,0,12],[1,1,4,1],[1,2,2,12],[10,1,10,12],[11,1,11,4],[11,5,11,6],[13,1,18,1],[19,1,21,1],[23,1,28,1],[12,11,12,12],[39,1,39,12],[41,1,41,12],[35,1,35,7],[36,1,36,7],[37,1,37,7]]}
[]
[null,{"$error":"#VALUE!"},"Sugarcane Ethanol Pathway Summary"]
[]
[null,null,"FOR APPLICANT ONLY - CONTAINS CONFIDENTIAL BUSINESS INFORMATION - DO NOT DISTRIBUTE"]
[]
[]
[null,"Application #",{"$f":"IF('Site-Specific Inputs'!C3=\"\",\"\",'Site-Specific Inputs'!C3)","v":""},null,"Finished Fuel Quantities"]
[null,"Company Name and ID",{"$f":"IF('Site-Specific Inputs'!C4=\"\",\"\",CONCATENATE('Site-Specific Inputs'!C4,\" \",\"(\",'Site-Specific Inputs'!C5,\")\"))","v":""},null,"Unit","Undenatured Anhydrous Ethanol Produced","Denaturant Added","Denatured Anhydrous Ethanol Produced","Total Ethanol from Sugarcane Juice","Total Ethanol from Sugarcane Molasses","Total Ethanol Produced","Ethanol Yield from Sugarcane Juice","Ethanol Yield from Sugarcane Molasses"]
[null,"Facility Address and ID",{"$f":"IF('Site-Specific Inputs'!C6=\"\",\"\",'Site-Specific Inputs'!C6)","v":""},null,"gallons",{"$f":"IF('Site-Specific Inputs'!V$33>0,'Site-Specific Inputs'!$V$33*'OR-GREET4.0'!C102,\"\")","v":""},{"$f":"IF('EF Tables'!G114>0,'EF Tables'!G114,\"\")","v":""},{"$f":"IF(SUM(F9:G9)>0,SUM(F9:G9),\"\")","v":""},{"$f":"IF('Calculated Parameters'!G$25>0,'Calculated Parameters'!G$25,\"\")","v":""},{"$f":"IF('Calculated Parameters'!F$25>0,'Calculated Parameters'!F$25,\"\")","v":""},{"$f":"IFERROR(J9+I9,\"\")","v":""},{"$f":"IF('Calculated Parameters'!G$23>0,'Calculated Parameters'!G$23,\"\")","v":""},{"$f":"IF('Calculated Parameters'!F$23>0,'Calculated Parameters'!F$23,\"\")","v":""}]
[null,"Operational Data Period",{"$f":"IF('Site-Specific Inputs'!E9>0,CONCATENATE(TEXT(MIN('Site-Specific Inputs'!E9:E32),\"mm/yyyy\"),\" — \",TEXT(MAX('Site-Specific Inputs'!E9:E32),\"mm/yyyy\")),)","v":0},null,"MJ (LHV)",{"$f":"IFERROR(F9*'OR-GREET4.0'!$D$77,\"\")","v":""},{"$f":"IFERROR(G9*'OR-GREET4.0'!D75,\"\")","v":""},{"$f":"IF(SUM(F10:G10)>0,SUM(F10:G10),\"\")","v":""},{"$f":"IFERROR(I9*'OR-GREET4.0'!$D$77,\"\")","v":""},{"$f":"IFERROR(J9*'OR-GREET4.0'!$D$77,\"\")","v":""},{"$f":"IFERROR(K9*'OR-GREET4.0'!$D$77,\"\")","v":""},"(gallons/m.t. cane)","(gallons/m.t. cane)"]
{"$rows_left_out":42}
{"sheet":"OR-GREET4.0","index":4,"n_rows":138,"n_cols":11,"rows_kept":138,"cut":false,"hidden":false,"merged":[[4,8,4,9],[9,8,9,9],[32,8,32,9],[33,8,33,9],[34,8,34,9],[76,9,76,10],[80,1,80,7],[82,1,82,8],[103,1,103,6],[105,1,105,8],[70,1,70,7],[70,9,70,10],[71,1,72,1],[71,2,71,4],[71,5,72,5],[71,6,73,6],[71,7,72,7],[72,2,72,3],[43,1,58,1],[43,2,52,2],[59,1,64,1],[59,2,64,2],[53,2,54,2],[56,2,57,2],[0,6,0,7],[3,2,9,2],[10,2,23,2],[24,2,25,2],[3,1,32,1],[1,1,1,5],[39,1,40,1],[34,2,35,2],[37,2,38,2],[26,2,29,2],[30,2,31,2],[39,2,40,2],[33,1,38,1]]}
[]
[null,"Tier 1 Sugarcane-derived Ethanol Calculator Inputs and Emission Factors"]
[null,"Category","Sub-Category","Name","Value","Unit"]
[null,"Feedstock Production","Farming","Total Farming Energy",93900,"Btu/tonne sugarcane"]
[null,null,null,"Individual Fuel Shares"]
[null,null,null,"Diesel Fuel",36385,"Btu/tonne sugarcane"]
[null,null,null,"Gasoline",11685,"Btu/tonne sugarcane"]
[null,null,null,"Natural Gas",19324,"Btu/tonne sugarcane"]
[null,null,null,"Liquefied Petroleum Gas",17956,"Btu/tonne sugarcane"]
[null,null,null,"Electricity",8550,"Btu/tonne sugarcane"]
{"$rows_left_out":129}
{"sheet":"EF Tables","index":5,"n_rows":185,"n_cols":23,"rows_kept":185,"cut":false,"hidden":true,"merged":[[29,3,29,8],[43,1,43,2],[59,1,59,2],[31,9,31,12],[42,16,42,17],[52,16,52,17],[31,16,31,17],[27,16,27,17],[69,16,69,17],[57,16,57,17],[33,16,33,17],[35,16,35,17],[37,16,37,17],[39,16,39,17],[154,5,154,9],[106,9,106,10],[125,5,125,7],[4,2,4,6],[5,2,6,2],[5,3,6,3],[5,4,7,4],[5,5,7,5],[5,6,7,6],[5,7,7,7],[17,4,19,4],[16,2,16,3],[17,2,18,2],[17,3,19,3],[17,5,18,5],[24,7,24,8],[30,19,30,22],[159,7,160,7],[119,1,120,1],[86,21,86,26],[86,18,86,20],[84,18,84,19],[89,16,89,17],[158,8,158,13],[158,1,158,6],[89,14,89,15],[98,1,98,5],[87,1,88,1],[89,2,89,10],[86,2,86,10],[142,8,142,9],[155,10,155,11],[119,2,119,3],[129,1,129,3],[128,1,128,3],[46,16,46,17],[49,16,49,17],[47,2,47,7],[115,8,115,10]]}
["References for Sugarcane Ethanol Pathways (HIDE SHEET)"]
[]
["I.","Factors for Sugarcane Transport to Mill"]
[]
[null,null,"Sugarcane Transport to Mill"]
[null,null,"HDD (grams/ton-mile cane transported)","MDD (grams/ton-mile cane transported)","HDD (grams/tonne cane transported)","MDD (grams/tonne cane transported)","Total (grams/tonne cane transported)","Total (gCO2e/tonne cane transported)"]
[]
[null,null,{"$f":"IFERROR((SUMPRODUCT('Site-Specific Inputs'!F9:F32,'Site-Specific Inputs'!G9:G32)+SUMPRODUCT('Site-Specific Inputs'!H9:H32,'Site-Specific Inputs'!I9:I32))/(SUM('Site-Specific Inputs'!F9:F32)+SUM('Site-Specific Inputs'!H9:H32))/1.609,0)","v":0},2]
[null,"              VOC",7.4692232219487203E-2,0.13450006050928978,{"$f":"C$8*C9*1000/(2000*0.4536)","v":0},{"$f":"$D$8*D9*1000/(2000*0.4536)","v":0.29651688824799338},{"$f":"F9+E9","v":0.29651688824799338},{"$f":"G9*'Old Fuel_Specs'!D58","v":0.92414430170624606},null,null,"GWP"]
[null,"              CO",0.25974062687574484,0.46746395261846391,{"$f":"C$8*C10*1000/(2000*0.4536)","v":0},{"$f":"$D$8*D10*1000/(2000*0.4536)","v":1.0305642694410579},{"$f":"F10+E10","v":1.0305642694410579},{"$f":"G10*'Old Fuel_Specs'!D59","v":1.619458137693091},null,"     VOC",{"$f":"'Old Fuel_Specs'!D58","v":3.1166666666666667}]
{"$rows_left_out":176}
{"sheet":"EF General","index":6,"n_rows":173,"n_cols":20,"rows_kept":173,"cut":false,"hidden":true,"merged":[]}
[]
["Generalized Emissions Factors (EF General) for CI Determination (HIDE SHEET)."]
[]
[]
["Factor 1 - Sugarcane Farming Impacts",null,null,null,null,null,"gCO2e/MJ"]
["Sugarcane Farming",null,null,null,null,null,{"$f":"IF('Site-Specific Inputs'!S32=0,'Calculated Parameters'!G93,'Calculated Parameters'!M93)","v":"-"}]
["Fertilizers",null,null,null,null,null,{"$f":"IF('Site-Specific Inputs'!S$32=0,'Calculated Parameters'!G94,'Calculated Parameters'!M94)","v":0}]
["N2O in Soil",null,null,null,null,null,{"$f":"IF('Site-Specific Inputs'!S$32=0,'Calculated Parameters'!G95,'Calculated Parameters'!M95)","v":"-"}]
[null,null,null,null,null,"Total:",{"$f":"SUM(G6:G8)","v":0},"gCO2e"]
[null,null,null,null,null,null,null,{"$f":"10^6","v":1000000},"J","Btu"]
{"$rows_left_out":164}
{"sheet":"Old Fuel_Specs","index":7,"n_rows":83,"n_cols":9,"rows_kept":83,"cut":false,"hidden":true,"merged":[[43,2,43,3],[39,2,39,3],[37,2,37,3],[51,2,51,3],[52,2,52,3],[38,2,38,3],[40,2,40,3],[42,2,42,3],[53,2,53,3],[54,2,54,3],[45,2,45,3],[46,2,46,3],[48,2,48,3],[49,2,49,3],[50,2,50,3],[47,2,47,3],[33,2,33,3],[21,2,21,3],[22,2,22,3],[11,2,11,3],[12,2,12,3],[31,2,31,3],[32,2,32,3],[24,2,24,3],[25,2,25,3],[27,2,27,3],[28,2,28,3],[29,2,29,3],[16,4,19,4],[1,1,1,4],[7,2,7,3],[8,2,8,3],[9,2,9,3],[10,2,10,3]]}
[]
[null,"General References for Sugarcane-based Ethanol Pathways (HIDE)"]
[]
[null,"Feedstock Type","Sugarcane Juice","Molasses","Sources"]
[null,"Juice-to-Sugar share, %",null,"User Defined"]
[null,"Sucrose in Sugarcane Juice (Entering Process)",null,"User Defined"]
[null,"a. Farming Energy"]
[null,"Total Farming Energy","95,000 Btu/tonne",null,"OR-GREET 3.0"]
[null,"     Diesel fuel",36385]
[null,"     Gasoline",11685]
{"$rows_left_out":73}