{"text_format":"1","workbook":"xlsx","n_sheets":7,"sheets":["Introduction","Pathway Summary","Manure-to-Biogas (LOP Inputs)","Avoided Emissions","Biogas-to-RNG","EF Table","Reference"],"not_rendered":{"charts":0,"images":4,"macros":1,"external_links":0,"defined_names":2,"comments":5,"pivot_tables":0},"unopened":[],"bounds":{"document_bytes":16777216,"sheet_cells":100000,"rows_first":2000,"rows_last":500,"rows_between":2000,"halvings":0,"cell_chars":16384,"cell_head_chars":4096},"cells_cut":0,"cells_raw":0,"read":"whole","date_system":"1900"}

{"sheet":"Introduction","index":0,"n_rows":47,"n_cols":6,"rows_kept":47,"cut":false,"hidden":false,"merged":[[11,1,11,7],[1,1,1,7],[2,1,2,7],[3,2,4,6],[6,1,9,2],[6,4,9,4],[6,6,9,7]]}
[]
[null,{"$error":"#VALUE!"}]
[null,"Low Carbon Fuel Standard\nTier 1 CI Calculator for Dairy and Swine Manure Biomethane (Release Date: 08/12/2024)"]
[null,null,"The Tier 1 Calculator for Biomethane from Anaerobic Digestion of Dairy and Swine Manure offers a simplified interface for calculating the carbon intensity (CI) of biomethane produced from the anaerobic digestion of dairy and swine manure. To begin, please navigate to the \"Manure-to-Biogas (LOP Inputs)\", \"Biogas-to-RNG\", and \"Avoided Emissions\" worksheets and enter all relevant data. Inputs entered by the applicant are limited to all yellow cells (see Color Key below) and are subject to be validated and verified by a third-party verifier. Inputs that do not apply to the fuel pathway may be left blank. Cells containing calculated or predefined input values may not be modified without DEQ approval via a Tier 2 pathway. \n\nThe carbon Intensity (CI) summary is provided in the \"Pathway Summary\" worksheet. A conservative margin of safety may be added to the calculated CI in this worksheet to establish the final CI. Pathway-specific Operating Conditions may be added by DEQ prior to pathway certification.\n\nNotes:\n1. \"Manure-to-Biogas (LOP Inputs)\" worksheet\n    • Annual lagoon cleanout is required for the baseline modeling (Fields L1.(1-6).15) for both Tier 1 and Tier 2 pathways. Please refer to the Instruction Manual of the calculator for more details. \n    • Field L3.1 is not a user input, to adjust the operational data period, please update Field 2.3 in the \"Biogas-to-RNG\" worksheet. \n    • Please select either \"12\" or \"24” months for Field L1.1.2. If the number of baseline reporting month entered in Fields L1.(1-6).7 does not match the entry in Field L1.1.2, an \"ERROR\" message will appear in the total baseline methane emission from Anaerobic Storage/Treatment Systems (cells N33, AB33, AP33, BD33, BR33, and CF33). Once 24 months are selected for the baseline reporting period, the applicant must continue to model the 24-month baseline moving forward (including Annual Fuel Pathway Reports). Please refer to the Instruction Manual of the calculator for more details.\n    • Calculated herd populations are not allowed to establish the initial VS carryover (Fields L1.(1-6).16). If herd populations used to establish the initial VS carryover are not verifiable, enter zero for the initial VS carryover. \n\n2. \"Biogas-to-RNG\" worksheet\n    • For Section 1, the \"Company Name\" represents the fuel pathway applicant (\"Fuel Producer\" in AFP), whereas the \"Facility Name\" represents the fuel production facility (\"Facility\" in the AFP).\n    • A minimum of 3 months of project operational data is required in Section 2. The project reporting month populated in Field 2.3 must be entirely covered by the baseline reporting month populated in Fields L1.(1-6).7 in the \"Manure-to-Biogas (LOP Inputs)\" worksheet. If the number of project reporting months is fewer than the number of baseline reporting months, the project reporting month must align with the latest baseline reporting month.    \n    • If less than 24 months of project operational data is reported in the Annual Fuel Pathway Reports, the operational data period must include the reported months established during pathway initial certification. \n    • Please enter the name of each joint applicant/intermediate facility included in this fuel pathway in Field 1.11. All joint applicants must also be registered in the AFP to align with the legal name of the facility or with US EPA facility registration. \n\n3. This calculator contains macros. If using Microsoft Excel, users will have to select the \"Enable Content\" button upon opening this calculator and select \"Automatic\" calculations from the \"Calculation Options\" in the \"Formulas\" toolbar or press F9 to ensure that the calculator results are accurate."]
[]
[]
[null,null,null,"Color Key",null,"CFP Website Resources"]
[null,null,null,"User Input",null,"CFP Program Overview"]
[null,null,null,"Calculated Value",null,"Tier 1 Pathway Calculators and Instruction Manuals"]
[null,null,null,"OR-GREET4.0 Input",null,"Tier 1 Pathway Application Process"]
{"$rows_left_out":38}
{"sheet":"Pathway Summary","index":1,"n_rows":80,"n_cols":6,"rows_kept":80,"cut":false,"hidden":false,"merged":[[79,0,85,5],[5,1,5,3],[7,4,7,5],[78,0,78,5],[0,0,0,3],[0,4,0,5],[1,1,1,3],[2,1,2,3],[3,1,3,3],[4,1,4,3]]}
["SUMMARY AND OPERATING CONDITIONS OF DAIRY/SWINE MANURE TO CNG/LNG/L-CNG PATHWAY",null,null,null,"(FOR APPLICANT TO REVIEW ONLY - CONTAINS CONFIDENTIAL BUSINESS INFORMATION - DO NOT DISTRIBUTE)"]
["AXXXX/BXXXX","Input Data",null,null,"Output Results, gCO2e/MJ","Biogas"]
["Applicant",{"$f":"IF('Biogas-to-RNG'!C15=\"\",\"\",'Biogas-to-RNG'!C15)","v":""},null,null,"CNG Carbon Intensity: ",{"$f":"IF(F59=0,\"N/A\",F59)","v":"N/A"}]
["Digester Location:",{"$f":"IF('Biogas-to-RNG'!C18=\"\",\"\",'Biogas-to-RNG'!C18)","v":""},null,null,"Certification Date: ","TBD"]
["Pathway Description:",null,null,null,"FPC Code: ","TBD"]
[null,null,null,null,"First Reporting Month for Certification",{"$f":"IF('Biogas-to-RNG'!B28<>\"\", 'Biogas-to-RNG'!B28, \"\")","v":""}]
[null,null,null,null,"Number of Project Reporting Month",{"$f":"IF('Biogas-to-RNG'!J24<>0, 'Biogas-to-RNG'!J24, \"\")","v":""}]
["User Inputs Parameters","Value","Unit","Note","CI Breakdown (gCO2e/MJ)"]
["1) Project Background Information"]
["Average total livestock population",{"$f":"IFERROR(AVERAGE('Manure-to-Biogas (LOP Inputs)'!D9:D32),0)+IFERROR(AVERAGE('Manure-to-Biogas (LOP Inputs)'!R9:R32),0)+IFERROR(AVERAGE('Manure-to-Biogas (LOP Inputs)'!AF9:AF32),0)+IFERROR(AVERAGE('Manure-to-Biogas (LOP Inputs)'!AT9:AT32),0)+IFERROR(AVERAGE('Manure-to-Biogas (LOP Inputs)'!BH9:BH32),0)+IFERROR(AVERAGE('Manure-to-Biogas (LOP Inputs)'!BV9:BV32),0)","v":0},"head"]
{"$rows_left_out":71}
{"sheet":"Manure-to-Biogas (LOP Inputs)","index":2,"n_rows":108,"n_cols":84,"rows_kept":108,"cut":false,"hidden":false,"merged":[[91,1,91,8],[92,3,92,8],[1,2,1,7],[35,1,35,8],[36,3,36,8],[80,1,80,10],[83,8,88,8],[83,9,88,9],[83,10,88,10],[49,1,49,8],[50,1,51,1],[50,2,50,5],[50,6,50,7],[50,8,51,8]]}
[]
[null,{"$error":"#VALUE!"},"Calculations Based on Selected Equations from the \n\"Compliance Offset Protocol Livestock Projects\" (LOP)"]
[]
[]
[null,"Section L1: Baseline Methane Emissions from Anaerobic Storage/Treatment Systems (BECH4,AS) (Reference: [Equation 5.3 in LOP])"]
[null,"L1.1.1 \nLivestock Category (L)\n1","L1.1.7\nReporting Month ","L1.1.8\nLivestock Population","L1.1.9\nCalendar Days of the Month","L1.1.10\nNumber of Reporting Days","L1.1.11\nAverage Temperature","L1.1.12\nVan't Hoff-Arrhenius factor ","L1.1.13\n Fraction of Volatile Solids Sent to Anaerobic Storage/Treatment System","L1.1.14\nVolatile Solids Available for Degradation","L1.1.15\nRetention Time and Drainage","L1.1.16\nCarryover from Previous Month","L1.1.17\nVolatile Solids Degraded","L1.1.18\nBaseline Methane Emissions, AS",null,"L1.2.1 \nLivestock Category (L)\n2","L1.2.7\nReporting Month ","L1.2.8\nLivestock Population","L1.2.9\nCalendar Days of the Month","L1.2.10\nNumber of Reporting Days","L1.2.11 \nAverage Temperature","L1.2.12\nVan't Hoff-Arrhenius factor ","L1.2.13 \nFraction of Volatile Solids Sent to Anaerobic Storage/Treatment System","L1.2.14 \nVolatile Solids Available for Degradation","L1.2.15\nRetention Time and Drainage","L1.2.16\nCarryover from Previous Month","L1.2.17\nVolatile Solids Degraded","L1.2.18\nBaseline Methane Emissions, AS",null,"L1.3.1 \nLivestock Category (L)\n3","L1.3.7\nReporting Month ","L1.3.8\nLivestock Population","L1.3.9\nCalendar Days of the Month","L1.3.10 \nNumber of Reporting Days","L1.3.11\nAverage Temperature","L1.3.12\nVan't Hoff-Arrhenius factor ","L1.3.13\nFraction of Volatile Solids Sent to Anaerobic Storage/Treatment System","L1.3.14\nVolatile Solids Available for Degradation","L1.3.15\nRetention Time and Drainage","L1.3.16\nCarryover from Previous Month","L1.3.17\nVolatile Solids Degraded","L1.3.18\nBaseline Methane Emissions, AS",null,"L1.4.1 \nLivestock Category (L)\n4","L1.4.7\nReporting Month ","L1.4.8\nLivestock Population","L1.4.9\nCalendar Days of the Month","L1.4.10\nNumber of Reporting Days","L1.4.11\nAverage Temperature","L1.4.12\nVan't Hoff-Arrhenius factor ","L1.4.13\nFraction of Volatile Solids Sent to Anaerobic Storage/Treatment System","L1.4.14\nVolatile Solids Available for Degradation","L1.4.15\nRetention Time and Drainage","L1.4.16\nCarryover from Previous Month","L1.4.17\nVolatile Solids Degraded","L1.4.18\nBaseline Methane Emissions, AS",null,"L1.5.1 \nLivestock Category (L)\n5","L1.5.7\nReporting Month ","L1.5.8\nLivestock Population","L1.5.9\nCalendar Days of the Month","L1.5.10\nNumber of Reporting Days","L1.5.11 \nAverage Temperature","L1.5.12\nVan't Hoff-Arrhenius factor ","L1.5.13\nFraction of Volatile Solids Sent to Anaerobic Storage/Treatment System","L1.5.14 \nVolatile Solids Available for Degradation","L1.5.15\nRetention Time and Drainage","L1.5.16\nCarryover from Previous Month","L1.5.17\nVolatile Solids Degraded","L1.5.18\nBaseline Methane Emissions, AS",null,"L1.6.1 \nLivestock Category (L)\n6","L1.6.7\nReporting Month ","L1.6.8 \nLivestock Population","L1.6.9\nCalendar Days of the Month","L1.6.10\nNumber of Reporting Days","L1.6.11\nAverage Temperature","L1.6.12\nVan't Hoff-Arrhenius factor ","L1.6.13\nFraction of Volatile Solids Sent to Anaerobic Storage/Treatment System","L1.6.14 \nVolatile Solids Available for Degradation","L1.6.15\nRetention Time and Drainage","L1.6.16\nCarryover from Previous Month","L1.6.17\nVolatile Solids Degraded","L1.6.18\nBaseline Methane Emissions, AS"]
[null,"-","(MM/YYYY)","PL","days","RDrm  (days)","T2 (°C)","f","MSAS,L (fraction)","VSavail,AS (kg)","Select \"System Emptied in This Month\" for each September","(VSavail-1,AS -VSdeg-1,AS) (kg)","VSdeg,AS (kg)","BECH4,AS (MT CH4)",null,"-","(MM/YYYY)","PL","days","RDrm  (days)","T2 (°C)","f","MSAS,L (fraction)","VSavail,AS (kg)","Select \"System Emptied in This Month\" for each September","(VSavail-1,AS -VSdeg-1,AS) (kg)","VSdeg,AS (kg)","BECH4,AS (MT CH4)",null,"-","(MM/YYYY)","PL","days","RDrm  (days)","T2 (°C)","f","MSAS,L (fraction)","VSavail,AS (kg)","Select \"System Emptied in This Month\" for each September","(VSavail-1,AS -VSdeg-1,AS) (kg)","VSdeg,AS (kg)","BECH4,AS (MT CH4)",null,"-","(MM/YYYY)","PL","days","RDrm  (days)","T2 (°C)","f","MSAS,L (fraction)","VSavail,AS (kg)","Select \"System Emptied in This Month\" for each September","(VSavail-1,AS -VSdeg-1,AS) (kg)","VSdeg,AS (kg)","BECH4,AS (MT CH4)",null,"-","(MM/YYYY)","PL","days","RDrm  (days)","T2 (°C)","f","MSAS,L (fraction)","VSavail,AS (kg)","Select \"System Emptied in This Month\" for each September","(VSavail-1,AS -VSdeg-1,AS) (kg)","VSdeg,AS (kg)","BECH4,AS (MT CH4)",null,"-","(MM/YYYY)","PL","days","RDrm  (days)","T2 (°C)","f","MSAS,L (fraction)","VSavail,AS (kg)","Select \"System Emptied in This Month\" for each September","(VSavail-1,AS -VSdeg-1,AS) (kg)","VSdeg,AS (kg)","BECH4,AS (MT CH4)"]
[null,"L1.1.2 Baseline Reporting Period (Months)",null,null,null,null,null,null,null,null,null,null,null,null,null,"L1.2.2 Baseline Reporting Period (Months)",null,null,null,null,null,null,null,null,null,null,null,null,null,"L1.3.2 Baseline Reporting Period (Months)",null,null,null,null,null,null,null,null,null,null,null,null,null,"L1.4.2 Baseline Reporting Period (Months)",null,null,null,null,null,null,null,null,null,null,null,null,null,"L1.5.2 Baseline Reporting Period (Months)",null,null,null,null,null,null,null,null,null,null,null,null,null,"L1.6.2 Baseline Reporting Period (Months)"]
[null,"-",null,null,null,null,null,{"$f":"MIN(0.95, MAX(0.104, EXP(15175*((G9+273)-303.16)/(1.987*(G9+273)*303.17))))","v":0.104},null,{"$f":"(B$20*D9*I9*E9*0.8)+L9","v":0},"Not Applicable",0,{"$f":"J9*H9","v":0},{"$f":"IFERROR(M9*B$16*0.68*0.001*(F9/E9), 0)","v":0},null,{"$f":"$B$9","v":"-"},{"$f":"IF($C9=0, \"\", $C9)","v":""},null,{"$f":"E9","v":0},null,{"$f":"G9","v":0},{"$f":"MIN(0.95, MAX(0.104, EXP(15175*((U9+273)-303.16)/(1.987*(U9+273)*303.17))))","v":0.104},null,{"$f":"(P$20*R9*W9*S9*0.8)+Z9","v":0},"Not Applicable",0,{"$f":"X9*V9","v":0},{"$f":"IFERROR(AA9*P$16*0.68*0.001*(T9/S9), 0)","v":0},null,{"$f":"$B$9","v":"-"},{"$f":"IF($C9=0, \"\", $C9)","v":""},null,{"$f":"E9","v":0},null,{"$f":"G9","v":0},{"$f":"MIN(0.95, MAX(0.104, EXP(15175*((AI9+273)-303.16)/(1.987*(AI9+273)*303.17))))","v":0.104},null,{"$f":"(AD$20*AF9*AK9*AG9*0.8)+AN9","v":0},"Not Applicable",0,{"$f":"AL9*AJ9","v":0},{"$f":"IFERROR(AO9*AD$16*0.68*0.001*(AH9/AG9), 0)","v":0},null,{"$f":"$B$9","v":"-"},{"$f":"IF($C9=0, \"\", $C9)","v":""},null,{"$f":"E9","v":0},null,{"$f":"G9","v":0},{"$f":"MIN(0.95, MAX(0.104, EXP(15175*((AW9+273)-303.16)/(1.987*(AW9+273)*303.17))))","v":0.104},null,{"$f":"(AR$20*AT9*AY9*AU9*0.8)+BB9","v":0},"Not Applicable",0,{"$f":"AZ9*AX9","v":0},{"$f":"IFERROR(BC9*AR$16*0.68*0.001*(AV9/AU9), 0)","v":0},null,{"$f":"$B$9","v":"-"},{"$f":"IF($C9=0, \"\", $C9)","v":""},null,{"$f":"E9","v":0},null,{"$f":"G9","v":0},{"$f":"MIN(0.95, MAX(0.104, EXP(15175*((BK9+273)-303.16)/(1.987*(BK9+273)*303.17))))","v":0.104},null,{"$f":"(BF$20*BH9*BM9*BI9*0.8)+BP9","v":0},"Not Applicable",0,{"$f":"BN9*BL9","v":0},{"$f":"IFERROR(BQ9*BF$16*0.68*0.001*(BJ9/BI9), 0)","v":0},null,{"$f":"$B$9","v":"-"},{"$f":"IF($C9=0, \"\", $C9)","v":""},null,{"$f":"E9","v":0},null,{"$f":"G9","v":0},{"$f":"MIN(0.95, MAX(0.104, EXP(15175*((BY9+273)-303.16)/(1.987*(BY9+273)*303.17))))","v":0.104},null,{"$f":"(BT$20*BV9*CA9*BW9*0.8)+CD9","v":0},"Not Applicable",0,{"$f":"CB9*BZ9","v":0},{"$f":"IFERROR(CE9*BT$16*0.68*0.001*(BX9/BW9), 0)","v":0}]
[null,"L1.1.3 Livestock Average Mass",null,null,null,null,null,{"$f":"MIN(0.95, MAX(0.104, EXP(15175*((G10+273)-303.16)/(1.987*(G10+273)*303.17))))","v":0.104},null,{"$f":"(B$20*D10*I10*E10*0.8)+L10","v":0},"Not Applicable",{"$f":"IF(K9=\"Not Applicable\", (J9-M9), 0)","v":0},0,{"$f":"IFERROR(M10*B$16*0.68*0.001*(F10/E10), 0)","v":0},null,"L1.2.3 Livestock Average Mass",{"$f":"IF($C10=0, \"\", $C10)","v":""},null,{"$f":"E10","v":0},null,{"$f":"G10","v":0},{"$f":"MIN(0.95, MAX(0.104, EXP(15175*((U10+273)-303.16)/(1.987*(U10+273)*303.17))))","v":0.104},null,0,"Not Applicable",{"$f":"IF(Y9=\"Not Applicable\", (X9-AA9), 0)","v":0},0,{"$f":"IFERROR(AA10*P$16*0.68*0.001*(T10/S10), 0)","v":0},null,"L1.3.3 Livestock Average Mass",{"$f":"IF($C10=0, \"\", $C10)","v":""},null,{"$f":"E10","v":0},null,{"$f":"G10","v":0},{"$f":"MIN(0.95, MAX(0.104, EXP(15175*((AI10+273)-303.16)/(1.987*(AI10+273)*303.17))))","v":0.104},null,0,"Not Applicable",{"$f":"IF(AM9=\"Not Applicable\", (AL9-AO9), 0)","v":0},0,{"$f":"IFERROR(AO10*AD$16*0.68*0.001*(AH10/AG10), 0)","v":0},null,"L1.4.3 Livestock Average Mass",{"$f":"IF($C10=0, \"\", $C10)","v":""},null,{"$f":"E10","v":0},null,{"$f":"G10","v":0},{"$f":"MIN(0.95, MAX(0.104, EXP(15175*((AW10+273)-303.16)/(1.987*(AW10+273)*303.17))))","v":0.104},null,0,"Not Applicable",{"$f":"IF(BA9=\"Not Applicable\", (AZ9-BC9), 0)","v":0},0,{"$f":"IFERROR(BC10*AR$16*0.68*0.001*(AV10/AU10), 0)","v":0},null,"L1.5.3 Livestock Average Mass",{"$f":"IF($C10=0, \"\", $C10)","v":""},null,{"$f":"E10","v":0},null,{"$f":"G10","v":0},{"$f":"MIN(0.95, MAX(0.104, EXP(15175*((BK10+273)-303.16)/(1.987*(BK10+273)*303.17))))","v":0.104},null,0,"Not Applicable",{"$f":"IF(BO9=\"Not Applicable\", (BN9-BQ9), 0)","v":0},0,{"$f":"IFERROR(BQ10*BF$16*0.68*0.001*(BJ10/BI10), 0)","v":0},null,"L1.6.3 Livestock Average Mass",{"$f":"IF($C10=0, \"\", $C10)","v":""},null,{"$f":"E10","v":0},null,{"$f":"G10","v":0},{"$f":"MIN(0.95, MAX(0.104, EXP(15175*((BY10+273)-303.16)/(1.987*(BY10+273)*303.17))))","v":0.104},null,0,"Not Applicable",{"$f":"IF(CC9=\"Not Applicable\", (CB9-CE9), 0)","v":0},0,{"$f":"IFERROR(CE10*BT$16*0.68*0.001*(BX10/BW10), 0)","v":0}]
{"$rows_left_out":99}
{"sheet":"Avoided Emissions","index":3,"n_rows":52,"n_cols":8,"rows_kept":52,"cut":false,"hidden":false,"merged":[[45,1,45,3],[45,5,45,7],[34,1,34,3],[34,5,34,7],[34,8,35,9],[36,8,36,9],[37,5,39,7],[38,1,38,3],[2,1,2,6],[4,1,5,1],[4,2,5,2],[4,3,4,6],[7,4,30,4],[7,5,30,5]]}
[null,null,"Calculations of the Avoided Emissions"]
[]
[null,"Section P1. Results from the \"Manure-to-Biogas (LOP Inputs)\" tab"]
[null,"P1.1  Select Digester Type","Covered Lagoon"]
[null,"P1.2 Reporting Month\n(MM/YYYY)","P1.3 Baseline methane emissions (BECH4 Mod)","P1.4 Project methane emissions"]
[null,null,null,"P1.4.a Venting methane (CH4 vent)","P1.4.b Effluent ponds methane (PECH4,EP)","P1.4.c Storage/Treatment methane (PECH4,nBCS)","P1.4.d Digester leakage"]
[null,null,"Metric Ton","Metric Ton","Metric Ton","Metric Ton","Metric Ton"]
[null,{"$f":"IF('Manure-to-Biogas (LOP Inputs)'!C9=0, \" \", 'Manure-to-Biogas (LOP Inputs)'!C9)","v":" "},{"$f":"'Manure-to-Biogas (LOP Inputs)'!N9+'Manure-to-Biogas (LOP Inputs)'!AB9+'Manure-to-Biogas (LOP Inputs)'!AP9+'Manure-to-Biogas (LOP Inputs)'!BD9+'Manure-to-Biogas (LOP Inputs)'!BR9+'Manure-to-Biogas (LOP Inputs)'!CF9","v":0},{"$f":"'Manure-to-Biogas (LOP Inputs)'!I54","v":0},null,null,{"$f":"(('Biogas-to-RNG'!C28*'Biogas-to-RNG'!D28)*Reference!$E$16/(10^6)/(IF('Avoided Emissions'!$C$4=\"Covered Lagoon\",(100%-Reference!$D$107),(100%-Reference!$D$109))))-('Biogas-to-RNG'!C28*'Biogas-to-RNG'!D28*Reference!$E$16/10^6)","v":0}]
[null,{"$f":"IF('Manure-to-Biogas (LOP Inputs)'!C10=0, \" \", 'Manure-to-Biogas (LOP Inputs)'!C10)","v":" "},{"$f":"'Manure-to-Biogas (LOP Inputs)'!N10+'Manure-to-Biogas (LOP Inputs)'!AB10+'Manure-to-Biogas (LOP Inputs)'!AP10+'Manure-to-Biogas (LOP Inputs)'!BD10+'Manure-to-Biogas (LOP Inputs)'!BR10+'Manure-to-Biogas (LOP Inputs)'!CF10","v":0},{"$f":"'Manure-to-Biogas (LOP Inputs)'!I55","v":0},null,null,{"$f":"(('Biogas-to-RNG'!C29*'Biogas-to-RNG'!D29)*Reference!$E$16/(10^6)/(IF('Avoided Emissions'!$C$4=\"Covered Lagoon\",(100%-Reference!$D$107),(100%-Reference!$D$109))))-('Biogas-to-RNG'!C29*'Biogas-to-RNG'!D29*Reference!$E$16/10^6)","v":0}]
[null,{"$f":"IF('Manure-to-Biogas (LOP Inputs)'!C11=0, \" \", 'Manure-to-Biogas (LOP Inputs)'!C11)","v":" "},{"$f":"'Manure-to-Biogas (LOP Inputs)'!N11+'Manure-to-Biogas (LOP Inputs)'!AB11+'Manure-to-Biogas (LOP Inputs)'!AP11+'Manure-to-Biogas (LOP Inputs)'!BD11+'Manure-to-Biogas (LOP Inputs)'!BR11+'Manure-to-Biogas (LOP Inputs)'!CF11","v":0},{"$f":"'Manure-to-Biogas (LOP Inputs)'!I56","v":0},null,null,{"$f":"(('Biogas-to-RNG'!C30*'Biogas-to-RNG'!D30)*Reference!$E$16/(10^6)/(IF('Avoided Emissions'!$C$4=\"Covered Lagoon\",(100%-Reference!$D$107),(100%-Reference!$D$109))))-('Biogas-to-RNG'!C30*'Biogas-to-RNG'!D30*Reference!$E$16/10^6)","v":0}]
{"$rows_left_out":43}
{"sheet":"Biogas-to-RNG","index":4,"n_rows":99,"n_cols":38,"rows_kept":99,"cut":false,"hidden":false,"merged":[[91,6,92,6],[93,3,93,4],[83,5,84,5],[83,6,84,6],[94,2,95,4],[83,1,88,1],[83,2,85,2],[83,3,84,3],[83,4,84,4],[85,3,85,5],[88,3,88,5],[90,1,98,1],[90,3,90,4],[91,2,93,2],[91,5,92,5],[91,3,92,4],[26,37,27,37],[29,33,31,33],[81,1,82,1],[81,2,82,2],[32,34,37,34],[28,36,29,36],[28,37,29,37],[35,33,38,33],[41,33,44,33],[60,1,60,6],[63,2,69,2],[69,3,69,5],[70,2,80,2],[80,3,80,5],[53,33,53,34],[54,33,54,34],[23,14,23,15],[23,19,23,23],[24,17,24,29],[24,30,24,32],[26,36,27,36],[24,11,24,16],[16,5,16,6],[17,2,17,3],[18,2,18,3],[19,2,19,3],[1,17,1,23],[4,2,4,7],[15,5,15,6],[15,7,19,9],[16,2,16,3],[17,4,18,4],[17,5,18,6],[5,27,5,34],[9,3,9,9],[10,3,10,9],[86,2,87,2],[55,33,56,34],[57,33,57,34],[19,5,19,6],[11,3,11,9],[24,2,24,3],[24,4,24,5],[24,6,24,7],[24,8,24,10],[14,2,14,3],[14,5,14,6],[14,7,14,9],[15,2,15,3]]}
[]
[]
[]
[]
[null,null,"Tier 1 CI Calculator for\nDairy and Swine Manure Biomethane"]
[]
[]
[]
[null,"Pathway Summary and Estimated CI (g/MJ)"]
[null,"CNG CI",{"$f":"G97","v":0},{"$f":"CONCATENATE(\"Pathway Description: RNG produced from livestock manure, pipelined to \",F15, \" for Compressed Natural Gas\")","v":"Pathway Description: RNG produced from livestock manure, pipelined to  for Compressed Natural Gas"}]
{"$rows_left_out":90}
{"sheet":"EF Table","index":5,"n_rows":82,"n_cols":10,"rows_kept":82,"cut":false,"hidden":false,"merged":[[1,2,1,5],[73,2,73,4],[54,3,55,3],[36,3,37,3],[37,6,38,6],[39,6,40,6],[3,2,33,2],[3,5,33,5],[38,3,40,3],[36,2,41,2]]}
[]
[null,null,"OR-GREET 4.0 Emission Factor"]
[]
[null,null,"Grid Electricity\n (2021 eGRID Region, ORMX from Oregon 2021 Data)","U.S. Average",474.148181146963,"gCO2e/kWh"]
[null,null,null,"User Defined Mix"]
[null,null,null,"ORMX",403.07602628539564]
[null,null,null,"AKMS",305.05954532367298]
[null,null,null,"AZNM",452.59799644549003]
[null,null,null,"CAMX",329.31550896542899]
[null,null,null,"ERCT",470.46037472212402]
{"$rows_left_out":73}
{"sheet":"Reference","index":6,"n_rows":227,"n_cols":21,"rows_kept":227,"cut":false,"hidden":false,"merged":[[186,0,186,3],[106,0,107,0],[164,0,164,20],[165,1,165,20],[166,1,166,5],[166,6,166,16],[166,17,166,19],[166,20,167,20]]}
[]
[]
[]
["1) Specifications of Fuels"]
["Fuel","Heating Value",null,null,"Density"]
[null,"Calculation: LHV","LHV","HHV",null,"LHV/HHV"]
["Use LHV or HHV in calculations?",1,"1 -- LHV; 2 -- HHV"]
["Liquid Fuels:","Btu/gal","Btu/gal","Btu/gal","grams/gal"]
["U.S. conventional diesel",128450,128450,137380,3167,0.93499781627602274]
["CA conventional diesel"]
{"$rows_left_out":217}