{"text_format":"1","workbook":"xlsx","n_sheets":9,"sheets":["Identify Toxic Emitting Units","Identify Toxic Air Contaminants","Identify Exposure Locations","Summarize Risk","Calculate Dispersion Factors","Calculate Risk","RBCs","TACs","Dispersion Factors"],"not_rendered":{"charts":0,"images":1,"macros":1,"external_links":0,"defined_names":6,"comments":0,"pivot_tables":0},"unopened":[],"bounds":{"document_bytes":16777216,"sheet_cells":100000,"rows_first":2000,"rows_last":500,"rows_between":2000,"halvings":0,"cell_chars":16384,"cell_head_chars":4096},"cells_cut":0,"cells_raw":0,"read":"whole","date_system":"1900"}

{"sheet":"Identify Toxic Emitting Units","index":0,"n_rows":11,"n_cols":8,"rows_kept":11,"cut":false,"hidden":false,"merged":[[4,3,5,3],[4,2,5,2],[4,1,5,1],[4,4,5,4]]}
[]
[null,"Toxic Emission Units (TEUs)"]
[]
[]
[null,"TEU Identifier","Description","Emission Type","Number of TACs at TEU","Stack Height","Building Area","Building Height"]
[null,null,null,null,null,"m","ft^2","ft"]
[null,"Shredder-1","Metal Shredder - 10 ton/hour","Fugitive",38,null,100,10]
[null,"Diesel Engine-1",null,"Point",24,5]
[null,"ASR-1 MH","auto shredder waste emissions from drops","Fugitive",25,null,100,10]
[null,"ASR-1 Piles","auto shredder waste emissions from piles","Fugitive",21,null,100,10]
[null,"Drain","VOC emissions from draining auto fluids","Fugitive",6,null,100,10]

{"sheet":"Identify Toxic Air Contaminants","index":1,"n_rows":120,"n_cols":6,"rows_kept":120,"cut":false,"hidden":false,"merged":[[4,3,5,3],[4,1,5,1],[4,2,5,2]]}
[]
[null,"Toxic Air Contaminents and Emission Rates"]
[]
[]
[null,"TEU Identifier","TAC","CAS Number","Annual Emissions","Daily Max Emissions"]
[null,null,null,null,"lb/yr","lb/day"]
[null,"Shredder-1","Antimony and compounds",{"$f":"_xlfn.IFNA(IF(VLOOKUP(C7,TACcas,3,FALSE)=\"NoRBC\",\"NoRBC\",VLOOKUP(C7,TACcas,2,FALSE)),\"NoRBC\")","v":"7440-36-0"},5.0509499999999994E-3,1.4773303999999997E-5]
[null,"Shredder-1","Arsenic and compounds",{"$f":"_xlfn.IFNA(IF(VLOOKUP(C8,TACcas,3,FALSE)=\"NoRBC\",\"NoRBC\",VLOOKUP(C8,TACcas,2,FALSE)),\"NoRBC\")","v":"7440-38-2"},1.5858824113616052E-3,4.6384784983613073E-6]
[null,"Shredder-1","Barium and compounds",{"$f":"_xlfn.IFNA(IF(VLOOKUP(C9,TACcas,3,FALSE)=\"NoRBC\",\"NoRBC\",VLOOKUP(C9,TACcas,2,FALSE)),\"NoRBC\")","v":"NoRBC"},3.5429287913397563E-2,1.0362558347402921E-4]
[null,"Shredder-1","Beryllium and compounds",{"$f":"_xlfn.IFNA(IF(VLOOKUP(C10,TACcas,3,FALSE)=\"NoRBC\",\"NoRBC\",VLOOKUP(C10,TACcas,2,FALSE)),\"NoRBC\")","v":"7440-41-7"},3.3179809315721519E-4,9.704618134869399E-7]
[null,"Shredder-1","Cadmium and compounds",{"$f":"_xlfn.IFNA(IF(VLOOKUP(C11,TACcas,3,FALSE)=\"NoRBC\",\"NoRBC\",VLOOKUP(C11,TACcas,2,FALSE)),\"NoRBC\")","v":"7440-43-9"},0.1746315,5.1077207999999995E-4]
[null,"Shredder-1","Chromium VI, chromate, and dichromate particulate",{"$f":"_xlfn.IFNA(IF(VLOOKUP(C12,TACcas,3,FALSE)=\"NoRBC\",\"NoRBC\",VLOOKUP(C12,TACcas,2,FALSE)),\"NoRBC\")","v":"18540-29-9"},0.37372499999999997,1.0930919999999999E-3]
[null,"Shredder-1","Cobalt and compounds",{"$f":"_xlfn.IFNA(IF(VLOOKUP(C13,TACcas,3,FALSE)=\"NoRBC\",\"NoRBC\",VLOOKUP(C13,TACcas,2,FALSE)),\"NoRBC\")","v":"7440-48-4"},3.0351000000000002E-3,8.8772319999999995E-6]
[null,"Shredder-1","Copper and compounds",{"$f":"_xlfn.IFNA(IF(VLOOKUP(C14,TACcas,3,FALSE)=\"NoRBC\",\"NoRBC\",VLOOKUP(C14,TACcas,2,FALSE)),\"NoRBC\")","v":"7440-50-8"},3.4979392193862355E-2,1.0230970304896217E-4]
[null,"Shredder-1","Lead and compounds",{"$f":"_xlfn.IFNA(IF(VLOOKUP(C15,TACcas,3,FALSE)=\"NoRBC\",\"NoRBC\",VLOOKUP(C15,TACcas,2,FALSE)),\"NoRBC\")","v":"7439-92-1"},1.7485800000000002,5.1143456000000004E-3]
{"$rows_left_out":106}
{"sheet":"Identify Exposure Locations","index":2,"n_rows":11,"n_cols":10,"rows_kept":11,"cut":false,"hidden":false,"merged":[]}
[]
[null,"Exposure Locations"]
[null,"A map with the TEI and each Exposure Location labeled should be included with the submission."]
[]
[]
[null,"TEU Identifier","Residential Exposure Name","Distance (m)","Child Exposure Name","Distance (m)","Work Exposure Name","Distance (m)","Acute Exposure Name","Distance (m)"]
[null,"Shredder-1","Ridgecrest Timber Apartments",736,"Sitton School",955,"It's a better deal auto and truck recycling",30,"It's a better deal auto and truck recycling",30]
[null,"Diesel Engine-1","Ridgecrest Timber Apartments",736,"Sitton School",955,"It's a better deal auto and truck recycling",30,"It's a better deal auto and truck recycling",30]
[null,"ASR-1 MH","Ridgecrest Timber Apartments",736,"Sitton School",955,"It's a better deal auto and truck recycling",30,"It's a better deal auto and truck recycling",30]
[null,"ASR-1 Piles","Ridgecrest Timber Apartments",736,"Sitton School",955,"It's a better deal auto and truck recycling",30,"It's a better deal auto and truck recycling",30]
[null,"Drain","Ridgecrest Timber Apartments",736,"Sitton School",955,"It's a better deal auto and truck recycling",30,"It's a better deal auto and truck recycling",30]

{"sheet":"Summarize Risk","index":3,"n_rows":12,"n_cols":9,"rows_kept":12,"cut":false,"hidden":false,"merged":[[4,2,4,4],[4,5,4,7],[4,8,5,8],[4,1,5,1]]}
[]
[null,"Summary of Risk"]
[]
[]
[null,"TEU Identifier","Cancer Risk",null,null,"Chronic Risk",null,null,"Acute"]
[null,null,"Residential","Child","Worker","Residential","Child","Worker"]
[null,"Shredder-1",{"$f":"SUMIF('Calculate Risk'!$B$7:$B$120,$B7,'Calculate Risk'!L$7:L$120)","v":1.3722105574969714},{"$f":"SUMIF('Calculate Risk'!$B$7:$B$120,$B7,'Calculate Risk'!M$7:M$120)","v":3.3053891188951141E-2},{"$f":"SUMIF('Calculate Risk'!$B$7:$B$120,$B7,'Calculate Risk'!N$7:N$120)","v":4.5789868486964709},{"$f":"SUMIF('Calculate Risk'!$B$7:$B$120,$B7,'Calculate Risk'!O$7:O$120)","v":6.1719888585441453E-3},{"$f":"SUMIF('Calculate Risk'!$B$7:$B$120,$B7,'Calculate Risk'!P$7:P$120)","v":3.9600728888215445E-4},{"$f":"SUMIF('Calculate Risk'!$B$7:$B$120,$B7,'Calculate Risk'!Q$7:Q$120)","v":6.0001104376083997E-2},{"$f":"SUMIF('Calculate Risk'!$B$7:$B$120,$B7,'Calculate Risk'!R$7:R$120)","v":0.31690004362939861}]
[null,"Diesel Engine-1",{"$f":"SUMIF('Calculate Risk'!$B$7:$B$120,$B8,'Calculate Risk'!L$7:L$120)","v":2.7197973602444767},{"$f":"SUMIF('Calculate Risk'!$B$7:$B$120,$B8,'Calculate Risk'!M$7:M$120)","v":4.8977536801118986E-2},{"$f":"SUMIF('Calculate Risk'!$B$7:$B$120,$B8,'Calculate Risk'!N$7:N$120)","v":5.4931475241384584},{"$f":"SUMIF('Calculate Risk'!$B$7:$B$120,$B8,'Calculate Risk'!O$7:O$120)","v":3.2518531299019299E-2},{"$f":"SUMIF('Calculate Risk'!$B$7:$B$120,$B8,'Calculate Risk'!P$7:P$120)","v":2.1864204607617444E-3},{"$f":"SUMIF('Calculate Risk'!$B$7:$B$120,$B8,'Calculate Risk'!Q$7:Q$120)","v":0.29753350600056727},{"$f":"SUMIF('Calculate Risk'!$B$7:$B$120,$B8,'Calculate Risk'!R$7:R$120)","v":0.378579423389521}]
[null,"ASR-1 MH",{"$f":"SUMIF('Calculate Risk'!$B$7:$B$120,$B9,'Calculate Risk'!L$7:L$120)","v":6.5565159412834528E-2},{"$f":"SUMIF('Calculate Risk'!$B$7:$B$120,$B9,'Calculate Risk'!M$7:M$120)","v":1.0601967665775157E-3},{"$f":"SUMIF('Calculate Risk'!$B$7:$B$120,$B9,'Calculate Risk'!N$7:N$120)","v":0.26297631004329336},{"$f":"SUMIF('Calculate Risk'!$B$7:$B$120,$B9,'Calculate Risk'!O$7:O$120)","v":5.8444598488789287E-3},{"$f":"SUMIF('Calculate Risk'!$B$7:$B$120,$B9,'Calculate Risk'!P$7:P$120)","v":5.8573934369093872E-4},{"$f":"SUMIF('Calculate Risk'!$B$7:$B$120,$B9,'Calculate Risk'!Q$7:Q$120)","v":8.8748385407717983E-2},{"$f":"SUMIF('Calculate Risk'!$B$7:$B$120,$B9,'Calculate Risk'!R$7:R$120)","v":0.6911190766301053}]
[null,"ASR-1 Piles",{"$f":"SUMIF('Calculate Risk'!$B$7:$B$120,$B10,'Calculate Risk'!L$7:L$120)","v":8.1756543582855697E-4},{"$f":"SUMIF('Calculate Risk'!$B$7:$B$120,$B10,'Calculate Risk'!M$7:M$120)","v":1.1511719664367304E-5},{"$f":"SUMIF('Calculate Risk'!$B$7:$B$120,$B10,'Calculate Risk'!N$7:N$120)","v":2.4717875758875499E-3},{"$f":"SUMIF('Calculate Risk'!$B$7:$B$120,$B10,'Calculate Risk'!O$7:O$120)","v":8.9797634817875006E-5},{"$f":"SUMIF('Calculate Risk'!$B$7:$B$120,$B10,'Calculate Risk'!P$7:P$120)","v":8.9988335078564924E-6},{"$f":"SUMIF('Calculate Risk'!$B$7:$B$120,$B10,'Calculate Risk'!Q$7:Q$120)","v":1.3634596224024989E-3},{"$f":"SUMIF('Calculate Risk'!$B$7:$B$120,$B10,'Calculate Risk'!R$7:R$120)","v":9.947907007494327E-3}]
[null,"Drain",{"$f":"SUMIF('Calculate Risk'!$B$7:$B$120,$B11,'Calculate Risk'!L$7:L$120)","v":4.6962366989252539E-3},{"$f":"SUMIF('Calculate Risk'!$B$7:$B$120,$B11,'Calculate Risk'!M$7:M$120)","v":1.2102636426745698E-4},{"$f":"SUMIF('Calculate Risk'!$B$7:$B$120,$B11,'Calculate Risk'!N$7:N$120)","v":4.0342121422485659E-2},{"$f":"SUMIF('Calculate Risk'!$B$7:$B$120,$B11,'Calculate Risk'!O$7:O$120)","v":2.0546991069160972E-4},{"$f":"SUMIF('Calculate Risk'!$B$7:$B$120,$B11,'Calculate Risk'!P$7:P$120)","v":3.1012753307133984E-5},{"$f":"SUMIF('Calculate Risk'!$B$7:$B$120,$B11,'Calculate Risk'!Q$7:Q$120)","v":4.6989020162324221E-3},{"$f":"SUMIF('Calculate Risk'!$B$7:$B$120,$B11,'Calculate Risk'!R$7:R$120)","v":6.5558320869283579E-3}]
[null,"Total Risk",{"$f":"SUM(C7:C11)","v":4.1630868792890361},{"$f":"SUM(D7:D11)","v":8.3224162840579458E-2},{"$f":"SUM(E7:E11)","v":10.377924591876596},{"$f":"SUM(F7:F11)","v":4.4830247551951856E-2},{"$f":"SUM(G7:G11)","v":3.2081786801498283E-3},{"$f":"SUM(H7:H11)","v":0.45234535742300414},{"$f":"SUM(I7:I11)","v":1.4031022827434476}]

{"sheet":"Calculate Dispersion Factors","index":4,"n_rows":11,"n_cols":7,"rows_kept":11,"cut":false,"hidden":false,"merged":[[4,2,5,2],[4,1,5,1]]}
[]
[null,"Dispersion Factors"]
[]
[]
[null,"TEU","Type","DF Residential ","DF Child","DF Worker","DF Acute"]
[null,null,null,"ug/m3/lbs/yr","ug/m3/lbs/yr","ug/m3/lbs/yr","ug/m3/lbs/yr"]
[null,"Shredder-1","Fugitive",4.5399999999999999E-5,2.9699999999999997E-5,4.4999999999999997E-3,4.8]
[null,"Diesel Engine-1","Point",3.7120000000000004E-5,2.425E-5,3.3E-3,8.3000000000000007]
[null,"ASR-1 MH","Fugitive",4.5399999999999999E-5,2.9699999999999997E-5,4.4999999999999997E-3,4.8]
[null,"ASR-1 Piles","Fugitive",4.5399999999999999E-5,2.9699999999999997E-5,4.4999999999999997E-3,4.8]
[null,"Drain","Fugitive",4.5399999999999999E-5,2.9699999999999997E-5,4.4999999999999997E-3,4.8]

{"sheet":"Calculate Risk","index":5,"n_rows":120,"n_cols":18,"rows_kept":120,"cut":false,"hidden":false,"merged":[[4,17,5,17],[4,7,4,9],[4,10,5,10],[4,4,4,6],[4,1,5,1],[4,2,5,2],[4,3,5,3],[4,11,4,13],[4,14,4,16]]}
[]
[null,"Risk Calculations"]
[]
[]
[null,"TEU Identifier","TAC","CAS Number","Cancer RBC",null,null,"Chronic RBC",null,null,"Acute RBC","Cancer Risk",null,null,"Chronic Risk",null,null,"Acute"]
[null,null,null,null,"Residential","Child","Worker","Residential","Child","Worker",null,"Residential","Child","Worker","Residential","Child","Worker"]
[null,"Shredder-1","Antimony and compounds","7440-36-0","--","--","--",0.3,1.3,1.3,1,"--","--","--",{"$f":"'Identify Toxic Air Contaminants'!$E7*VLOOKUP($B7,'Calculate Dispersion Factors'!$B$7:$N$11,3,FALSE)/H7","v":7.6437709999999998E-7},{"$f":"'Identify Toxic Air Contaminants'!$E7*VLOOKUP($B7,'Calculate Dispersion Factors'!$B$7:$N$11,4,FALSE)/I7","v":1.1539478076923074E-7},{"$f":"'Identify Toxic Air Contaminants'!$E7*VLOOKUP($B7,'Calculate Dispersion Factors'!$B$7:$N$11,5,FALSE)/J7","v":1.7484057692307688E-5},{"$f":"'Identify Toxic Air Contaminants'!$F7*VLOOKUP($B7,'Calculate Dispersion Factors'!$B$7:$N$11,6,FALSE)/K7","v":7.0911859199999979E-5}]
[null,"Shredder-1","Arsenic and compounds","7440-38-2",2.4000000000000001E-5,1.2999999999999999E-3,6.2E-4,1.7000000000000001E-4,2.3999999999999998E-3,2.3999999999999998E-3,0.2,{"$f":"'Identify Toxic Air Contaminants'!$E8*VLOOKUP($B8,'Calculate Dispersion Factors'!$B$7:$N$11,3,FALSE)/E8","v":2.999960894825703E-3},{"$f":"'Identify Toxic Air Contaminants'!$E8*VLOOKUP($B8,'Calculate Dispersion Factors'!$B$7:$N$11,4,FALSE)/F8","v":3.6231313551876675E-5},{"$f":"'Identify Toxic Air Contaminants'!$E8*VLOOKUP($B8,'Calculate Dispersion Factors'!$B$7:$N$11,5,FALSE)/G8","v":1.1510436856656812E-2},{"$f":"'Identify Toxic Air Contaminants'!$E8*VLOOKUP($B8,'Calculate Dispersion Factors'!$B$7:$N$11,3,FALSE)/H8","v":4.2352389103421687E-4},{"$f":"'Identify Toxic Air Contaminants'!$E8*VLOOKUP($B8,'Calculate Dispersion Factors'!$B$7:$N$11,4,FALSE)/I8","v":1.9625294840599864E-5},{"$f":"'Identify Toxic Air Contaminants'!$E8*VLOOKUP($B8,'Calculate Dispersion Factors'!$B$7:$N$11,5,FALSE)/J8","v":2.9735295213030098E-3},{"$f":"'Identify Toxic Air Contaminants'!$F8*VLOOKUP($B8,'Calculate Dispersion Factors'!$B$7:$N$11,6,FALSE)/K8","v":1.1132348396067137E-4}]
[null,"Shredder-1","Barium and compounds","NoRBC","--","--","--","--","--","--","--"]
[null,"Shredder-1","Beryllium and compounds","7440-41-7",4.2000000000000002E-4,1.0999999999999999E-2,5.0000000000000001E-3,7.0000000000000001E-3,3.1E-2,3.1E-2,0.02,{"$f":"'Identify Toxic Air Contaminants'!$E10*VLOOKUP($B10,'Calculate Dispersion Factors'!$B$7:$N$11,3,FALSE)/E10","v":3.5865793879375165E-5},{"$f":"'Identify Toxic Air Contaminants'!$E10*VLOOKUP($B10,'Calculate Dispersion Factors'!$B$7:$N$11,4,FALSE)/F10","v":8.9585485152448099E-7},{"$f":"'Identify Toxic Air Contaminants'!$E10*VLOOKUP($B10,'Calculate Dispersion Factors'!$B$7:$N$11,5,FALSE)/G10","v":2.9861828384149366E-4},{"$f":"'Identify Toxic Air Contaminants'!$E10*VLOOKUP($B10,'Calculate Dispersion Factors'!$B$7:$N$11,3,FALSE)/H10","v":2.1519476327625097E-6},{"$f":"'Identify Toxic Air Contaminants'!$E10*VLOOKUP($B10,'Calculate Dispersion Factors'!$B$7:$N$11,4,FALSE)/I10","v":3.1788397957320294E-7},{"$f":"'Identify Toxic Air Contaminants'!$E10*VLOOKUP($B10,'Calculate Dispersion Factors'!$B$7:$N$11,5,FALSE)/J10","v":4.8164239329273171E-5},{"$f":"'Identify Toxic Air Contaminants'!$F10*VLOOKUP($B10,'Calculate Dispersion Factors'!$B$7:$N$11,6,FALSE)/K10","v":2.3291083523686556E-4}]
[null,"Shredder-1","Cadmium and compounds","7440-43-9",5.5999999999999995E-4,1.4E-2,6.7000000000000002E-3,5.0000000000000001E-3,3.6999999999999998E-2,3.6999999999999998E-2,0.03,{"$f":"'Identify Toxic Air Contaminants'!$E11*VLOOKUP($B11,'Calculate Dispersion Factors'!$B$7:$N$11,3,FALSE)/E11","v":1.4157625178571429E-2},{"$f":"'Identify Toxic Air Contaminants'!$E11*VLOOKUP($B11,'Calculate Dispersion Factors'!$B$7:$N$11,4,FALSE)/F11","v":3.7046825357142855E-4},{"$f":"'Identify Toxic Air Contaminants'!$E11*VLOOKUP($B11,'Calculate Dispersion Factors'!$B$7:$N$11,5,FALSE)/G11","v":0.11728981343283582},{"$f":"'Identify Toxic Air Contaminants'!$E11*VLOOKUP($B11,'Calculate Dispersion Factors'!$B$7:$N$11,3,FALSE)/H11","v":1.5856540199999998E-3},{"$f":"'Identify Toxic Air Contaminants'!$E11*VLOOKUP($B11,'Calculate Dispersion Factors'!$B$7:$N$11,4,FALSE)/I11","v":1.4017717702702703E-4},{"$f":"'Identify Toxic Air Contaminants'!$E11*VLOOKUP($B11,'Calculate Dispersion Factors'!$B$7:$N$11,5,FALSE)/J11","v":2.1238966216216217E-2},{"$f":"'Identify Toxic Air Contaminants'!$F11*VLOOKUP($B11,'Calculate Dispersion Factors'!$B$7:$N$11,6,FALSE)/K11","v":8.1723532799999998E-2}]
[null,"Shredder-1","Chromium VI, chromate, and dichromate particulate","18540-29-9",3.1000000000000001E-5,5.1999999999999995E-4,1E-3,8.3000000000000004E-2,0.88,0.88,0.3,{"$f":"'Identify Toxic Air Contaminants'!$E12*VLOOKUP($B12,'Calculate Dispersion Factors'!$B$7:$N$11,3,FALSE)/E12","v":0.54732629032258062},{"$f":"'Identify Toxic Air Contaminants'!$E12*VLOOKUP($B12,'Calculate Dispersion Factors'!$B$7:$N$11,4,FALSE)/F12","v":2.1345447115384615E-2},{"$f":"'Identify Toxic Air Contaminants'!$E12*VLOOKUP($B12,'Calculate Dispersion Factors'!$B$7:$N$11,5,FALSE)/G12","v":1.6817624999999998},{"$f":"'Identify Toxic Air Contaminants'!$E12*VLOOKUP($B12,'Calculate Dispersion Factors'!$B$7:$N$11,3,FALSE)/H12","v":2.0442307228915661E-4},{"$f":"'Identify Toxic Air Contaminants'!$E12*VLOOKUP($B12,'Calculate Dispersion Factors'!$B$7:$N$11,4,FALSE)/I12","v":1.2613218749999998E-5},{"$f":"'Identify Toxic Air Contaminants'!$E12*VLOOKUP($B12,'Calculate Dispersion Factors'!$B$7:$N$11,5,FALSE)/J12","v":1.9110937499999998E-3},{"$f":"'Identify Toxic Air Contaminants'!$F12*VLOOKUP($B12,'Calculate Dispersion Factors'!$B$7:$N$11,6,FALSE)/K12","v":1.7489471999999999E-2}]
[null,"Shredder-1","Cobalt and compounds","7440-48-4","--","--","--",0.1,0.44,0.44,"--","--","--","--",{"$f":"'Identify Toxic Air Contaminants'!$E13*VLOOKUP($B13,'Calculate Dispersion Factors'!$B$7:$N$11,3,FALSE)/H13","v":1.3779353999999998E-6},{"$f":"'Identify Toxic Air Contaminants'!$E13*VLOOKUP($B13,'Calculate Dispersion Factors'!$B$7:$N$11,4,FALSE)/I13","v":2.0486924999999999E-7},{"$f":"'Identify Toxic Air Contaminants'!$E13*VLOOKUP($B13,'Calculate Dispersion Factors'!$B$7:$N$11,5,FALSE)/J13","v":3.1040795454545454E-5},"--"]
[null,"Shredder-1","Copper and compounds","7440-50-8","--","--","--","--","--","--",100,"--","--","--","--","--","--",{"$f":"'Identify Toxic Air Contaminants'!$F14*VLOOKUP($B14,'Calculate Dispersion Factors'!$B$7:$N$11,6,FALSE)/K14","v":4.9108657463501845E-6}]
[null,"Shredder-1","Lead and compounds","7439-92-1","--","--","--",0.15,0.66,0.66,0.15,"--","--","--",{"$f":"'Identify Toxic Air Contaminants'!$E15*VLOOKUP($B15,'Calculate Dispersion Factors'!$B$7:$N$11,3,FALSE)/H15","v":5.2923688000000016E-4},{"$f":"'Identify Toxic Air Contaminants'!$E15*VLOOKUP($B15,'Calculate Dispersion Factors'!$B$7:$N$11,4,FALSE)/I15","v":7.8686100000000005E-5},{"$f":"'Identify Toxic Air Contaminants'!$E15*VLOOKUP($B15,'Calculate Dispersion Factors'!$B$7:$N$11,5,FALSE)/J15","v":1.1922136363636362E-2},{"$f":"'Identify Toxic Air Contaminants'!$F15*VLOOKUP($B15,'Calculate Dispersion Factors'!$B$7:$N$11,6,FALSE)/K15","v":0.16365905920000001}]
{"$rows_left_out":106}
{"sheet":"RBCs","index":6,"n_rows":265,"n_cols":10,"rows_kept":265,"cut":false,"hidden":false,"merged":[[1,1,3,1],[1,2,3,2],[1,3,1,4],[1,5,1,8],[1,0,3,0]]}
[]
[null,"CAS#","Chemical","Residential",null,"Non-Residential",null,null,null,"Acute "]
[null,null,null,"Cancer","Noncancer","Child Cancer","Child Noncancer","Worker Cancer","Worker Noncancer","Acute "]
[null,null,null,"(µg/m3)","(µg/m3)","(µg/m3)","(µg/m3)","(µg/m3)","(µg/m3)","(µg/m3)"]
[null,"75-07-0","Acetaldehyde",0.45,140,12,620,5.5,620,470]
[null,"60-35-5","Acetamide",0.05,"--",1.3,"--",0.6,"--","--"]
[null,"67-64-1","Acetone","--",31000,"--",140000,"--",140000,62000]
[null,"75-05-8","Acetonitrile","--",60,"--",260,"--",260,"--"]
[null,"107-02-8","Acrolein","--",0.35,"--",1.5,"--",1.5,6.9]
[null,"79-06-1","Acrylamide",5.8999999999999999E-3,6,6.2E-2,26,0.12,26,"--"]
[null,"79-10-7","Acrylic acid","--",1,"--",4.4000000000000004,"--",4.4000000000000004,6000]
[null,"107-13-1","Acrylonitrile",1.4999999999999999E-2,5,0.38,22,0.18,22,220]
[null,"309-00-2","Aldrin",2.0000000000000001E-4,"--",5.3E-3,"--",2.3999999999999998E-3,"--","--"]
[null,"107-05-1","Allyl chloride",0.17,1,4.3,4.4000000000000004,2,4.4000000000000004,"--"]
[null,"7429-90-5","Aluminum and compounds","--",5,"--",22,"--",22,"--"]
{"$rows_left_out":251}
{"sheet":"TACs","index":7,"n_rows":610,"n_cols":4,"rows_kept":610,"cut":false,"hidden":false,"merged":[]}
[]
[null,"Chemical","CAS#","RBC?"]
[null,"Acetaldehyde","75-07-0"]
[null,"Acetamide","60-35-5"]
[null,"Acetone","67-64-1"]
[null,"Acetonitrile","75-05-8"]
[null,"Acetophenone","98-86-2",{"$f":"IFERROR(VLOOKUP(C7,RBCs!$B$5:$C$265,2,FALSE),\"NoRBC\")","v":"NoRBC"}]
[null,"Acrolein","107-02-8"]
[null,"Acrylamide","79-06-1"]
[null,"Acrylic acid","79-10-7"]
[null,"Acrylonitrile","107-13-1"]
[null,"Actinomycin D","50-76-0",{"$f":"IFERROR(VLOOKUP(C12,RBCs!$B$5:$C$265,2,FALSE),\"NoRBC\")","v":"NoRBC"}]
[null,"Alar","1596-84-5",{"$f":"IFERROR(VLOOKUP(C13,RBCs!$B$5:$C$265,2,FALSE),\"NoRBC\")","v":"NoRBC"}]
[null,"Aldrin","309-00-2"]
[null,"Allyl chloride","107-05-1"]
{"$rows_left_out":596}
{"sheet":"Dispersion Factors","index":8,"n_rows":58,"n_cols":33,"rows_kept":58,"cut":false,"hidden":false,"merged":[[17,1,17,31],[0,1,0,31],[1,1,1,31],[2,1,2,31],[3,1,3,31],[4,6,4,31],[18,6,18,31],[31,1,31,32],[32,7,32,32],[45,1,45,32],[46,7,46,32]]}
[null,"OAR 340-245-8050 Table 5"]
[null,"Level 1 Risk Assessment Tool"]
[null,"Dispersion Factors"]
[null,"Table 5A: Stack Emission Dispersion Factors for Annual Exposure (µg/m3 / pounds/year)"]
[null,"Stack",null,null,null,null,"Exposure Location Distance (meters)"]
[null,"Ht (m)",10,20,30,40,50,60,70,80,90,100,110,120,130,140,150,160,170,180,190,200,250,300,350,400,450,500,600,700,800,1000]
[null,5,1.0999999999999999E-2,6.0000000000000001E-3,5.1999999999999998E-3,4.1000000000000003E-3,3.3E-3,2.5999999999999999E-3,2.0999999999999999E-3,1.6999999999999999E-3,1.4E-3,1.1999999999999999E-3,1E-3,8.8000000000000003E-4,7.6000000000000004E-4,6.6E-4,5.8E-4,5.1000000000000004E-4,4.6000000000000001E-4,4.0999999999999999E-4,3.6999999999999999E-4,3.4000000000000002E-4,2.3000000000000001E-4,1.7000000000000001E-4,1.2999999999999999E-4,1E-4,8.3999999999999995E-5,7.1000000000000005E-5,5.1999999999999997E-5,4.0000000000000003E-5,3.1999999999999999E-5,2.1999999999999999E-5]
[null,10,9.4999999999999998E-3,4.5999999999999999E-3,2.7000000000000001E-3,1.6000000000000001E-3,1.4E-3,1.1999999999999999E-3,1.1000000000000001E-3,9.3999999999999997E-4,8.4000000000000003E-4,7.5000000000000002E-4,6.8000000000000005E-4,6.2E-4,5.6999999999999998E-4,5.1999999999999995E-4,4.8000000000000001E-4,4.4000000000000002E-4,4.0999999999999999E-4,3.8000000000000002E-4,3.5E-4,3.3E-4,2.3000000000000001E-4,1.7000000000000001E-4,1.2999999999999999E-4,9.7999999999999997E-5,7.7999999999999999E-5,6.3999999999999997E-5,4.6999999999999997E-5,3.6000000000000001E-5,2.9E-5,2.0999999999999999E-5]
[null,15,4.3E-3,3.0000000000000001E-3,1.8E-3,1.2999999999999999E-3,7.5000000000000002E-4,6.0999999999999997E-4,5.4000000000000001E-4,4.8999999999999998E-4,4.4000000000000002E-4,4.0000000000000002E-4,3.6999999999999999E-4,3.4000000000000002E-4,3.1E-4,2.9E-4,2.7E-4,2.5000000000000001E-4,2.4000000000000001E-4,2.3000000000000001E-4,2.1000000000000001E-4,2.0000000000000001E-4,1.6000000000000001E-4,1.2999999999999999E-4,1E-4,8.2999999999999998E-5,6.8999999999999997E-5,5.7000000000000003E-5,4.1E-5,3.1999999999999999E-5,2.5000000000000001E-5,1.8E-5]
[null,20,2.3E-3,1.8E-3,1.2999999999999999E-3,8.8000000000000003E-4,7.2000000000000005E-4,5.4000000000000001E-4,3.5E-4,3.1E-4,2.7999999999999998E-4,2.5999999999999998E-4,2.3000000000000001E-4,2.2000000000000001E-4,2.0000000000000001E-4,1.9000000000000001E-4,1.7000000000000001E-4,1.6000000000000001E-4,1.4999999999999999E-4,1.3999999999999999E-4,1.3999999999999999E-4,1.2999999999999999E-4,1E-4,8.6000000000000003E-5,7.2999999999999999E-5,6.2000000000000003E-5,5.3000000000000001E-5,4.6E-5,3.4999999999999997E-5,2.6999999999999999E-5,2.0999999999999999E-5,1.5E-5]
[null,25,1.2999999999999999E-3,1.1000000000000001E-3,9.1E-4,6.6E-4,5.0000000000000001E-4,4.0999999999999999E-4,3.5E-4,2.5000000000000001E-4,1.9000000000000001E-4,1.8000000000000001E-4,1.6000000000000001E-4,1.4999999999999999E-4,1.3999999999999999E-4,1.2999999999999999E-4,1.2E-4,1.2E-4,1.1E-4,1E-4,9.6000000000000002E-5,9.1000000000000003E-5,7.2000000000000002E-5,5.8999999999999998E-5,5.1E-5,4.3999999999999999E-5,3.8999999999999999E-5,3.4E-5,2.6999999999999999E-5,2.1999999999999999E-5,1.8E-5,1.2999999999999999E-5]
[null,30,8.1999999999999998E-4,7.2999999999999996E-4,6.2E-4,5.0000000000000001E-4,3.6999999999999999E-4,2.9999999999999997E-4,2.5999999999999998E-4,2.3000000000000001E-4,1.9000000000000001E-4,1.2999999999999999E-4,1.2E-4,1.1E-4,1E-4,9.6000000000000002E-5,9.0000000000000006E-5,8.5000000000000006E-5,8.0000000000000007E-5,7.4999999999999993E-5,7.1000000000000005E-5,6.7999999999999999E-5,5.3000000000000001E-5,4.3999999999999999E-5,3.6999999999999998E-5,3.1999999999999999E-5,2.8E-5,2.5000000000000001E-5,2.0999999999999999E-5,1.7E-5,1.4E-5,1.0000000000000001E-5]
[null,35,5.2999999999999998E-4,4.8999999999999998E-4,4.2999999999999999E-4,3.6999999999999999E-4,2.9999999999999997E-4,2.3000000000000001E-4,1.9000000000000001E-4,1.7000000000000001E-4,1.4999999999999999E-4,1.2999999999999999E-4,1.1E-4,8.1000000000000004E-5,7.4999999999999993E-5,7.1000000000000005E-5,6.7999999999999999E-5,6.3999999999999997E-5,6.0999999999999999E-5,5.8E-5,5.5000000000000002E-5,5.1999999999999997E-5,4.1999999999999998E-5,3.4E-5,2.9E-5,2.5000000000000001E-5,2.1999999999999999E-5,1.9000000000000001E-5,1.5999999999999999E-5,1.4E-5,1.1E-5,8.4435308375617604E-6]
[null,40,3.6999999999999999E-4,3.4000000000000002E-4,3.1E-4,2.7E-4,2.3000000000000001E-4,1.9000000000000001E-4,1.4999999999999999E-4,1.2999999999999999E-4,1.2E-4,1.1E-4,9.6000000000000002E-5,8.1000000000000004E-5,6.3999999999999997E-5,5.3999999999999998E-5,5.1E-5,4.8999999999999998E-5,4.6999999999999997E-5,4.5000000000000003E-5,4.3000000000000002E-5,4.1E-5,3.3000000000000003E-5,2.8E-5,2.3E-5,2.0000000000000002E-5,1.8E-5,1.5999999999999999E-5,1.2999999999999999E-5,1.1E-5,9.3306957262908366E-6,7.0463861920172599E-6]
[null,45,2.7E-4,2.5000000000000001E-4,2.3000000000000001E-4,2.1000000000000001E-4,1.8000000000000001E-4,1.6000000000000001E-4,1.2999999999999999E-4,1.1E-4,9.5000000000000005E-5,8.5000000000000006E-5,7.7999999999999999E-5,7.2000000000000002E-5,6.3E-5,5.3000000000000001E-5,4.1999999999999998E-5,3.8000000000000002E-5,3.6999999999999998E-5,3.6000000000000001E-5,3.4E-5,3.3000000000000003E-5,2.6999999999999999E-5,2.3E-5,1.9000000000000001E-5,1.7E-5,1.5E-5,1.2999999999999999E-5,1.1E-5,8.9914292753738986E-6,7.8039420938378147E-6,5.9786441061701769E-6]
{"$rows_left_out":43}