{"text_format":"1","workbook":"xlsx","n_sheets":9,"sheets":["Identify Toxic Emitting Units","Identify Toxic Air Contaminants","Identify Exposure Locations","Summarize Risk","Calculate Dispersion Factors","Calculate Risk","RBCs","TACs","Dispersion Factors"],"not_rendered":{"charts":0,"images":1,"macros":1,"external_links":0,"defined_names":6,"comments":0,"pivot_tables":0},"unopened":[],"bounds":{"document_bytes":16777216,"sheet_cells":100000,"rows_first":2000,"rows_last":500,"rows_between":2000,"halvings":0,"cell_chars":16384,"cell_head_chars":4096},"cells_cut":0,"cells_raw":0,"read":"whole","date_system":"1900"}

{"sheet":"Identify Toxic Emitting Units","index":0,"n_rows":11,"n_cols":8,"rows_kept":11,"cut":false,"hidden":false,"merged":[[4,3,5,3],[4,2,5,2],[4,1,5,1],[4,4,5,4]]}
[]
[null,"Toxic Emission Units (TEUs)"]
[]
[]
[null,"TEU Identifier","Description","Emission Type","Number of TACs at TEU","Stack Height","Building Area","Building Height"]
[null,null,null,null,null,"m","ft^2","ft"]
[null,"Shredder-1","Metal Shredder - 10 ton/hour","Fugitive",38,null,100,10]
[null,"Diesel Engine-1",null,"Point",24,5]
[null,"ASR-1 MH","auto shredder waste emissions from drops","Fugitive",25,null,100,10]
[null,"ASR-1 Piles","auto shredder waste emissions from piles","Fugitive",21,null,100,10]
[null,"Drain","VOC emissions from draining auto fluids","Fugitive",6,null,100,10]

{"sheet":"Identify Toxic Air Contaminants","index":1,"n_rows":120,"n_cols":6,"rows_kept":120,"cut":false,"hidden":false,"merged":[[4,3,5,3],[4,1,5,1],[4,2,5,2]]}
[]
[null,"Toxic Air Contaminents and Emission Rates"]
[]
[]
[null,"TEU Identifier","TAC","CAS Number","Annual Emissions","Daily Max Emissions"]
[null,null,null,null,"lb/yr","lb/day"]
[null,"Shredder-1","Antimony and compounds",{"$f":"_xlfn.IFNA(IF(VLOOKUP(C7,TACcas,3,FALSE)=\"NoRBC\",\"NoRBC\",VLOOKUP(C7,TACcas,2,FALSE)),\"NoRBC\")","v":"7440-36-0"},5.0509499999999994E-3,1.4773303999999997E-5]
[null,"Shredder-1","Arsenic and compounds",{"$f":"_xlfn.IFNA(IF(VLOOKUP(C8,TACcas,3,FALSE)=\"NoRBC\",\"NoRBC\",VLOOKUP(C8,TACcas,2,FALSE)),\"NoRBC\")","v":"7440-38-2"},1.5858824113616052E-3,4.6384784983613073E-6]
[null,"Shredder-1","Barium and compounds",{"$f":"_xlfn.IFNA(IF(VLOOKUP(C9,TACcas,3,FALSE)=\"NoRBC\",\"NoRBC\",VLOOKUP(C9,TACcas,2,FALSE)),\"NoRBC\")","v":"NoRBC"},3.5429287913397563E-2,1.0362558347402921E-4]
[null,"Shredder-1","Beryllium and compounds",{"$f":"_xlfn.IFNA(IF(VLOOKUP(C10,TACcas,3,FALSE)=\"NoRBC\",\"NoRBC\",VLOOKUP(C10,TACcas,2,FALSE)),\"NoRBC\")","v":"7440-41-7"},3.3179809315721519E-4,9.704618134869399E-7]
[null,"Shredder-1","Cadmium and compounds",{"$f":"_xlfn.IFNA(IF(VLOOKUP(C11,TACcas,3,FALSE)=\"NoRBC\",\"NoRBC\",VLOOKUP(C11,TACcas,2,FALSE)),\"NoRBC\")","v":"7440-43-9"},0.1746315,5.1077207999999995E-4]
[null,"Shredder-1","Chromium VI, chromate, and dichromate particulate",{"$f":"_xlfn.IFNA(IF(VLOOKUP(C12,TACcas,3,FALSE)=\"NoRBC\",\"NoRBC\",VLOOKUP(C12,TACcas,2,FALSE)),\"NoRBC\")","v":"18540-29-9"},0.37372499999999997,1.0930919999999999E-3]
[null,"Shredder-1","Cobalt and compounds",{"$f":"_xlfn.IFNA(IF(VLOOKUP(C13,TACcas,3,FALSE)=\"NoRBC\",\"NoRBC\",VLOOKUP(C13,TACcas,2,FALSE)),\"NoRBC\")","v":"7440-48-4"},3.0351000000000002E-3,8.8772319999999995E-6]
[null,"Shredder-1","Copper and compounds",{"$f":"_xlfn.IFNA(IF(VLOOKUP(C14,TACcas,3,FALSE)=\"NoRBC\",\"NoRBC\",VLOOKUP(C14,TACcas,2,FALSE)),\"NoRBC\")","v":"7440-50-8"},3.4979392193862355E-2,1.0230970304896217E-4]
[null,"Shredder-1","Lead and compounds",{"$f":"_xlfn.IFNA(IF(VLOOKUP(C15,TACcas,3,FALSE)=\"NoRBC\",\"NoRBC\",VLOOKUP(C15,TACcas,2,FALSE)),\"NoRBC\")","v":"7439-92-1"},1.7485800000000002,5.1143456000000004E-3]
[null,"Shredder-1","Manganese and compounds",{"$f":"_xlfn.IFNA(IF(VLOOKUP(C16,TACcas,3,FALSE)=\"NoRBC\",\"NoRBC\",VLOOKUP(C16,TACcas,2,FALSE)),\"NoRBC\")","v":"7439-96-5"},5.404372330916675E-2,1.5807013606117788E-4]
[null,"Shredder-1","Mercury and compounds",{"$f":"_xlfn.IFNA(IF(VLOOKUP(C17,TACcas,3,FALSE)=\"NoRBC\",\"NoRBC\",VLOOKUP(C17,TACcas,2,FALSE)),\"NoRBC\")","v":"7439-97-6"},1.1247392988380178,3.2897010626675937E-3]
[null,"Shredder-1","Nickel compounds, insoluble",{"$f":"_xlfn.IFNA(IF(VLOOKUP(C18,TACcas,3,FALSE)=\"NoRBC\",\"NoRBC\",VLOOKUP(C18,TACcas,2,FALSE)),\"NoRBC\")","v":"365"},1.9964122554374814E-2,5.8392193862349784E-5]
[null,"Shredder-1","Phosphorus and compounds",{"$f":"_xlfn.IFNA(IF(VLOOKUP(C19,TACcas,3,FALSE)=\"NoRBC\",\"NoRBC\",VLOOKUP(C19,TACcas,2,FALSE)),\"NoRBC\")","v":"NoRBC"},204140.18273910022,597.08074287416821]
[null,"Shredder-1","Selenium and compounds",{"$f":"_xlfn.IFNA(IF(VLOOKUP(C20,TACcas,3,FALSE)=\"NoRBC\",\"NoRBC\",VLOOKUP(C20,TACcas,2,FALSE)),\"NoRBC\")","v":"7782-49-2"},6.8046727579700065E-3,1.990269142913894E-5]
[null,"Shredder-1","Thallium and compounds",{"$f":"_xlfn.IFNA(IF(VLOOKUP(C21,TACcas,3,FALSE)=\"NoRBC\",\"NoRBC\",VLOOKUP(C21,TACcas,2,FALSE)),\"NoRBC\")","v":"NoRBC"},1.3215686761346708E-3,3.8653987486344222E-6]
[null,"Shredder-1","Silver and compounds",{"$f":"_xlfn.IFNA(IF(VLOOKUP(C22,TACcas,3,FALSE)=\"NoRBC\",\"NoRBC\",VLOOKUP(C22,TACcas,2,FALSE)),\"NoRBC\")","v":"NoRBC"},5.7361704240738894E-3,1.6777475419604725E-5]
[null,"Shredder-1","Zinc and compounds",{"$f":"_xlfn.IFNA(IF(VLOOKUP(C23,TACcas,3,FALSE)=\"NoRBC\",\"NoRBC\",VLOOKUP(C23,TACcas,2,FALSE)),\"NoRBC\")","v":"NoRBC"},3.8184899195550703,1.1168535107756481E-2]
[null,"Shredder-1","1,1-Dichloroethane (Ethylidene dichloride)",{"$f":"_xlfn.IFNA(IF(VLOOKUP(C24,TACcas,3,FALSE)=\"NoRBC\",\"NoRBC\",VLOOKUP(C24,TACcas,2,FALSE)),\"NoRBC\")","v":"75-34-3"},0.30124500000000004,8.810984E-4]
[null,"Shredder-1","Benzene",{"$f":"_xlfn.IFNA(IF(VLOOKUP(C25,TACcas,3,FALSE)=\"NoRBC\",\"NoRBC\",VLOOKUP(C25,TACcas,2,FALSE)),\"NoRBC\")","v":"71-43-2"},25.795715091148281,7.5448765269686149E-2]
[null,"Shredder-1","Ethyl benzene",{"$f":"_xlfn.IFNA(IF(VLOOKUP(C26,TACcas,3,FALSE)=\"NoRBC\",\"NoRBC\",VLOOKUP(C26,TACcas,2,FALSE)),\"NoRBC\")","v":"100-41-4"},23.752490133433568,6.947262544634468E-2]
[null,"Shredder-1","Hexane",{"$f":"_xlfn.IFNA(IF(VLOOKUP(C27,TACcas,3,FALSE)=\"NoRBC\",\"NoRBC\",VLOOKUP(C27,TACcas,2,FALSE)),\"NoRBC\")","v":"110-54-3"},77.472279646682949,0.226595301635031]
[null,"Shredder-1","Bromomethane (Methyl bromide)",{"$f":"_xlfn.IFNA(IF(VLOOKUP(C28,TACcas,3,FALSE)=\"NoRBC\",\"NoRBC\",VLOOKUP(C28,TACcas,2,FALSE)),\"NoRBC\")","v":"74-83-9"},2.9371358767149029E-2,8.5907009960533716E-5]
[null,"Shredder-1","1,1,1-Trichloroethane (Methyl chloroform)",{"$f":"_xlfn.IFNA(IF(VLOOKUP(C29,TACcas,3,FALSE)=\"NoRBC\",\"NoRBC\",VLOOKUP(C29,TACcas,2,FALSE)),\"NoRBC\")","v":"71-55-6"},4.53,1.32496E-2]
[null,"Shredder-1","2-Butanone (Methyl ethyl ketone)",{"$f":"_xlfn.IFNA(IF(VLOOKUP(C30,TACcas,3,FALSE)=\"NoRBC\",\"NoRBC\",VLOOKUP(C30,TACcas,2,FALSE)),\"NoRBC\")","v":"78-93-3"},0.12072449999999998,3.5310183999999993E-4]
[null,"Shredder-1","Methyl isobutyl ketone (MIBK, Hexone)",{"$f":"_xlfn.IFNA(IF(VLOOKUP(C31,TACcas,3,FALSE)=\"NoRBC\",\"NoRBC\",VLOOKUP(C31,TACcas,2,FALSE)),\"NoRBC\")","v":"108-10-1"},1.9410637098289794,5.6773328321744025E-3]
[null,"Shredder-1","Dichloromethane (Methylene chloride)",{"$f":"_xlfn.IFNA(IF(VLOOKUP(C32,TACcas,3,FALSE)=\"NoRBC\",\"NoRBC\",VLOOKUP(C32,TACcas,2,FALSE)),\"NoRBC\")","v":"75-09-2"},5.3634655140011267,1.5687367036271375E-2]
[null,"Shredder-1","Naphthalene",{"$f":"_xlfn.IFNA(IF(VLOOKUP(C33,TACcas,3,FALSE)=\"NoRBC\",\"NoRBC\",VLOOKUP(C33,TACcas,2,FALSE)),\"NoRBC\")","v":"91-20-3"},0.77897951512873531,2.2784033076489385E-3]
[null,"Shredder-1","Styrene",{"$f":"_xlfn.IFNA(IF(VLOOKUP(C34,TACcas,3,FALSE)=\"NoRBC\",\"NoRBC\",VLOOKUP(C34,TACcas,2,FALSE)),\"NoRBC\")","v":"100-42-5"},8.1303326442398038,2.3780056380379624E-2]
[null,"Shredder-1","Tetrachloroethene (Perchloroethylene)",{"$f":"_xlfn.IFNA(IF(VLOOKUP(C35,TACcas,3,FALSE)=\"NoRBC\",\"NoRBC\",VLOOKUP(C35,TACcas,2,FALSE)),\"NoRBC\")","v":"127-18-4"},0.45972561548581092,1.3446314602518323E-3]
[null,"Shredder-1","Toluene",{"$f":"_xlfn.IFNA(IF(VLOOKUP(C36,TACcas,3,FALSE)=\"NoRBC\",\"NoRBC\",VLOOKUP(C36,TACcas,2,FALSE)),\"NoRBC\")","v":"108-88-3"},121.3164818643112,0.35483330201090013]
[null,"Shredder-1","Trichloroethene (TCE, Trichloroethylene)",{"$f":"_xlfn.IFNA(IF(VLOOKUP(C37,TACcas,3,FALSE)=\"NoRBC\",\"NoRBC\",VLOOKUP(C37,TACcas,2,FALSE)),\"NoRBC\")","v":"79-01-6"},1.5107549999999998,4.4187415999999997E-3]
[null,"Shredder-1","Vinyl Chloride",{"$f":"_xlfn.IFNA(IF(VLOOKUP(C38,TACcas,3,FALSE)=\"NoRBC\",\"NoRBC\",VLOOKUP(C38,TACcas,2,FALSE)),\"NoRBC\")","v":"75-01-4"},7.7897951512873514E-2,2.2784033076489379E-4]
[null,"Shredder-1","Vinylidene chloride",{"$f":"_xlfn.IFNA(IF(VLOOKUP(C39,TACcas,3,FALSE)=\"NoRBC\",\"NoRBC\",VLOOKUP(C39,TACcas,2,FALSE)),\"NoRBC\")","v":"75-35-4"},0.60445404999060326,1.7679413644051869E-3]
[null,"Shredder-1","Xylene (mixture), including m-xylene, o-xylene, p-xylene",{"$f":"_xlfn.IFNA(IF(VLOOKUP(C40,TACcas,3,FALSE)=\"NoRBC\",\"NoRBC\",VLOOKUP(C40,TACcas,2,FALSE)),\"NoRBC\")","v":"1330-20-7"},110.81090020672806,0.32410598308588612]
[null,"Shredder-1","Polychlorinated biphenyls (PCBs)",{"$f":"_xlfn.IFNA(IF(VLOOKUP(C41,TACcas,3,FALSE)=\"NoRBC\",\"NoRBC\",VLOOKUP(C41,TACcas,2,FALSE)),\"NoRBC\")","v":"1336-36-3"},3.42015,1.0003448E-2]
[null,"Shredder-1","Polychlorinated biphenyls (PCBs) TEQ",{"$f":"_xlfn.IFNA(IF(VLOOKUP(C42,TACcas,3,FALSE)=\"NoRBC\",\"NoRBC\",VLOOKUP(C42,TACcas,2,FALSE)),\"NoRBC\")","v":"645"},5.9116499999999995E-6,1.7290727999999998E-8]
[null,"Shredder-1","Polychlorinated dibenzo-p-dioxins (PCDDs) & dibenzofurans (PCDFs) TEQ",{"$f":"_xlfn.IFNA(IF(VLOOKUP(C43,TACcas,3,FALSE)=\"NoRBC\",\"NoRBC\",VLOOKUP(C43,TACcas,2,FALSE)),\"NoRBC\")","v":"646"},3.9410999999999997E-7,1.1527151999999998E-9]
[null,"Shredder-1","Polycyclic aromatic hydrocarbons (PAHs)",{"$f":"_xlfn.IFNA(IF(VLOOKUP(C44,TACcas,3,FALSE)=\"NoRBC\",\"NoRBC\",VLOOKUP(C44,TACcas,2,FALSE)),\"NoRBC\")","v":"401"},0.20351024999999998,5.9523827999999985E-4]
[null,"Diesel Engine-1","Benzene",{"$f":"_xlfn.IFNA(IF(VLOOKUP(C45,TACcas,3,FALSE)=\"NoRBC\",\"NoRBC\",VLOOKUP(C45,TACcas,2,FALSE)),\"NoRBC\")","v":"71-43-2"},13.503024,3.9494407679999996E-2]
[null,"Diesel Engine-1","1,3-Butadiene",{"$f":"_xlfn.IFNA(IF(VLOOKUP(C46,TACcas,3,FALSE)=\"NoRBC\",\"NoRBC\",VLOOKUP(C46,TACcas,2,FALSE)),\"NoRBC\")","v":"106-99-0"},15.757152000000001,4.6087408640000001E-2]
[null,"Diesel Engine-1","Cadmium and compounds",{"$f":"_xlfn.IFNA(IF(VLOOKUP(C47,TACcas,3,FALSE)=\"NoRBC\",\"NoRBC\",VLOOKUP(C47,TACcas,2,FALSE)),\"NoRBC\")","v":"7440-43-9"},0.10872,3.1799040000000001E-4]
[null,"Diesel Engine-1","Formaldehyde",{"$f":"_xlfn.IFNA(IF(VLOOKUP(C48,TACcas,3,FALSE)=\"NoRBC\",\"NoRBC\",VLOOKUP(C48,TACcas,2,FALSE)),\"NoRBC\")","v":"50-00-0"},125.10772799999999,0.36592215295999997]
[null,"Diesel Engine-1","Chromium VI, chromate, and dichromate particulate",{"$f":"_xlfn.IFNA(IF(VLOOKUP(C49,TACcas,3,FALSE)=\"NoRBC\",\"NoRBC\",VLOOKUP(C49,TACcas,2,FALSE)),\"NoRBC\")","v":"18540-29-9"},7.248000000000001E-3,2.119936E-5]
[null,"Diesel Engine-1","Arsenic and compounds",{"$f":"_xlfn.IFNA(IF(VLOOKUP(C50,TACcas,3,FALSE)=\"NoRBC\",\"NoRBC\",VLOOKUP(C50,TACcas,2,FALSE)),\"NoRBC\")","v":"7440-38-2"},0.11596800000000002,3.3918975999999999E-4]
[null,"Diesel Engine-1","Lead and compounds",{"$f":"_xlfn.IFNA(IF(VLOOKUP(C51,TACcas,3,FALSE)=\"NoRBC\",\"NoRBC\",VLOOKUP(C51,TACcas,2,FALSE)),\"NoRBC\")","v":"7439-92-1"},0.60158400000000001,1.75954688E-3]
[null,"Diesel Engine-1","Nickel compounds, insoluble",{"$f":"_xlfn.IFNA(IF(VLOOKUP(C52,TACcas,3,FALSE)=\"NoRBC\",\"NoRBC\",VLOOKUP(C52,TACcas,2,FALSE)),\"NoRBC\")","v":"365"},0.28267199999999998,8.2677503999999992E-4]
[null,"Diesel Engine-1","Naphthalene",{"$f":"_xlfn.IFNA(IF(VLOOKUP(C53,TACcas,3,FALSE)=\"NoRBC\",\"NoRBC\",VLOOKUP(C53,TACcas,2,FALSE)),\"NoRBC\")","v":"91-20-3"},1.4278559999999998,4.1762739199999992E-3]
[null,"Diesel Engine-1","Polycyclic aromatic hydrocarbons (PAHs)",{"$f":"_xlfn.IFNA(IF(VLOOKUP(C54,TACcas,3,FALSE)=\"NoRBC\",\"NoRBC\",VLOOKUP(C54,TACcas,2,FALSE)),\"NoRBC\")","v":"401"},2.6237760000000003,7.6741683200000008E-3]
[null,"Diesel Engine-1","Benzo[a]pyrene*",{"$f":"_xlfn.IFNA(IF(VLOOKUP(C55,TACcas,3,FALSE)=\"NoRBC\",\"NoRBC\",VLOOKUP(C55,TACcas,2,FALSE)),\"NoRBC\")","v":"50-32-8"},2.57304E-3,7.5257727999999996E-6]
[null,"Diesel Engine-1","Acetaldehyde",{"$f":"_xlfn.IFNA(IF(VLOOKUP(C56,TACcas,3,FALSE)=\"NoRBC\",\"NoRBC\",VLOOKUP(C56,TACcas,2,FALSE)),\"NoRBC\")","v":"75-07-0"},56.773584,0.16605458687999999]
[null,"Diesel Engine-1","Acrolein",{"$f":"_xlfn.IFNA(IF(VLOOKUP(C57,TACcas,3,FALSE)=\"NoRBC\",\"NoRBC\",VLOOKUP(C57,TACcas,2,FALSE)),\"NoRBC\")","v":"107-02-8"},2.4570719999999997,7.1865830399999988E-3]
[null,"Diesel Engine-1","Ammonia**",{"$f":"_xlfn.IFNA(IF(VLOOKUP(C58,TACcas,3,FALSE)=\"NoRBC\",\"NoRBC\",VLOOKUP(C58,TACcas,2,FALSE)),\"NoRBC\")","v":"7664-41-7"},57.984000000000002,0.16959488]
[null,"Diesel Engine-1","Copper and compounds",{"$f":"_xlfn.IFNA(IF(VLOOKUP(C59,TACcas,3,FALSE)=\"NoRBC\",\"NoRBC\",VLOOKUP(C59,TACcas,2,FALSE)),\"NoRBC\")","v":"7440-50-8"},0.29716800000000004,8.691737600000001E-4]
[null,"Diesel Engine-1","Ethyl benzene",{"$f":"_xlfn.IFNA(IF(VLOOKUP(C60,TACcas,3,FALSE)=\"NoRBC\",\"NoRBC\",VLOOKUP(C60,TACcas,2,FALSE)),\"NoRBC\")","v":"100-41-4"},0.79003200000000007,2.3107302399999999E-3]
[null,"Diesel Engine-1","Hexane",{"$f":"_xlfn.IFNA(IF(VLOOKUP(C61,TACcas,3,FALSE)=\"NoRBC\",\"NoRBC\",VLOOKUP(C61,TACcas,2,FALSE)),\"NoRBC\")","v":"110-54-3"},1.9497119999999999,5.7026278399999993E-3]
[null,"Diesel Engine-1","Hydrochloric acid",{"$f":"_xlfn.IFNA(IF(VLOOKUP(C62,TACcas,3,FALSE)=\"NoRBC\",\"NoRBC\",VLOOKUP(C62,TACcas,2,FALSE)),\"NoRBC\")","v":"7647-01-0"},13.503024,3.9494407679999996E-2]
[null,"Diesel Engine-1","Manganese and compounds",{"$f":"_xlfn.IFNA(IF(VLOOKUP(C63,TACcas,3,FALSE)=\"NoRBC\",\"NoRBC\",VLOOKUP(C63,TACcas,2,FALSE)),\"NoRBC\")","v":"7439-96-5"},0.224688,6.5718015999999995E-4]
[null,"Diesel Engine-1","Mercury and compounds",{"$f":"_xlfn.IFNA(IF(VLOOKUP(C64,TACcas,3,FALSE)=\"NoRBC\",\"NoRBC\",VLOOKUP(C64,TACcas,2,FALSE)),\"NoRBC\")","v":"7439-97-6"},0.14496000000000001,4.2398719999999998E-4]
[null,"Diesel Engine-1","Selenium and compounds",{"$f":"_xlfn.IFNA(IF(VLOOKUP(C65,TACcas,3,FALSE)=\"NoRBC\",\"NoRBC\",VLOOKUP(C65,TACcas,2,FALSE)),\"NoRBC\")","v":"7782-49-2"},0.15945600000000001,4.6638592E-4]
[null,"Diesel Engine-1","Toluene",{"$f":"_xlfn.IFNA(IF(VLOOKUP(C66,TACcas,3,FALSE)=\"NoRBC\",\"NoRBC\",VLOOKUP(C66,TACcas,2,FALSE)),\"NoRBC\")","v":"108-88-3"},7.639392,2.2344125439999998E-2]
[null,"Diesel Engine-1","Xylene (mixture), including m-xylene, o-xylene, p-xylene",{"$f":"_xlfn.IFNA(IF(VLOOKUP(C67,TACcas,3,FALSE)=\"NoRBC\",\"NoRBC\",VLOOKUP(C67,TACcas,2,FALSE)),\"NoRBC\")","v":"1330-20-7"},3.0731519999999999,8.98852864E-3]
[null,"Diesel Engine-1","Diesel Particulate Matter",{"$f":"_xlfn.IFNA(IF(VLOOKUP(C68,TACcas,3,FALSE)=\"NoRBC\",\"NoRBC\",VLOOKUP(C68,TACcas,2,FALSE)),\"NoRBC\")","v":"200"},536.35199999999998,1.56875264]
[null,"ASR-1 MH","Aluminum and compounds",{"$f":"_xlfn.IFNA(IF(VLOOKUP(C69,TACcas,3,FALSE)=\"NoRBC\",\"NoRBC\",VLOOKUP(C69,TACcas,2,FALSE)),\"NoRBC\")","v":"7429-90-5"},4.7004925696661175,1.3748266302659642E-2]
[null,"ASR-1 MH","Arsenic and compounds",{"$f":"_xlfn.IFNA(IF(VLOOKUP(C70,TACcas,3,FALSE)=\"NoRBC\",\"NoRBC\",VLOOKUP(C70,TACcas,2,FALSE)),\"NoRBC\")","v":"7440-38-2"},9.556274601608369E-3,2.795073200032456E-5]
[null,"ASR-1 MH","Barium and compounds",{"$f":"_xlfn.IFNA(IF(VLOOKUP(C71,TACcas,3,FALSE)=\"NoRBC\",\"NoRBC\",VLOOKUP(C71,TACcas,2,FALSE)),\"NoRBC\")","v":"NoRBC"},2.0605717109718046E-2,6.0268765875699841E-5]
[null,"ASR-1 MH","Cadmium and compounds",{"$f":"_xlfn.IFNA(IF(VLOOKUP(C72,TACcas,3,FALSE)=\"NoRBC\",\"NoRBC\",VLOOKUP(C72,TACcas,2,FALSE)),\"NoRBC\")","v":"7440-43-9"},1.517058593005329E-2,4.4371787050515234E-5]
[null,"ASR-1 MH","Cobalt and compounds",{"$f":"_xlfn.IFNA(IF(VLOOKUP(C73,TACcas,3,FALSE)=\"NoRBC\",\"NoRBC\",VLOOKUP(C73,TACcas,2,FALSE)),\"NoRBC\")","v":"7440-48-4"},1.3080150860951455E-2,3.8257564425444232E-5]
[null,"ASR-1 MH","Copper and compounds",{"$f":"_xlfn.IFNA(IF(VLOOKUP(C74,TACcas,3,FALSE)=\"NoRBC\",\"NoRBC\",VLOOKUP(C74,TACcas,2,FALSE)),\"NoRBC\")","v":"7440-50-8"},21.119366869554501,6.1771117720717264E-2]
[null,"ASR-1 MH","Lead and compounds",{"$f":"_xlfn.IFNA(IF(VLOOKUP(C75,TACcas,3,FALSE)=\"NoRBC\",\"NoRBC\",VLOOKUP(C75,TACcas,2,FALSE)),\"NoRBC\")","v":"7439-92-1"},6.928299086166068,2.0264280700235303E-2]
[null,"ASR-1 MH","Manganese and compounds",{"$f":"_xlfn.IFNA(IF(VLOOKUP(C76,TACcas,3,FALSE)=\"NoRBC\",\"NoRBC\",VLOOKUP(C76,TACcas,2,FALSE)),\"NoRBC\")","v":"7439-96-5"},0.32670513794248612,9.5556565026109575E-4]
[null,"ASR-1 MH","Mercury and compounds",{"$f":"_xlfn.IFNA(IF(VLOOKUP(C77,TACcas,3,FALSE)=\"NoRBC\",\"NoRBC\",VLOOKUP(C77,TACcas,2,FALSE)),\"NoRBC\")","v":"7439-97-6"},3.8822365569034006E-4,1.1354984875131852E-6]
[null,"ASR-1 MH","Nickel compounds, insoluble",{"$f":"_xlfn.IFNA(IF(VLOOKUP(C78,TACcas,3,FALSE)=\"NoRBC\",\"NoRBC\",VLOOKUP(C78,TACcas,2,FALSE)),\"NoRBC\")","v":"365"},0.23293419341420402,6.8129909250791117E-4]
[null,"ASR-1 MH","Zinc and compounds",{"$f":"_xlfn.IFNA(IF(VLOOKUP(C79,TACcas,3,FALSE)=\"NoRBC\",\"NoRBC\",VLOOKUP(C79,TACcas,2,FALSE)),\"NoRBC\")","v":"NoRBC"},6.9880258024261206,2.0438972775237332E-2]
[null,"ASR-1 MH","Benzene",{"$f":"_xlfn.IFNA(IF(VLOOKUP(C80,TACcas,3,FALSE)=\"NoRBC\",\"NoRBC\",VLOOKUP(C80,TACcas,2,FALSE)),\"NoRBC\")","v":"71-43-2"},6.7949999999999997E-2,1.9874399999999997E-4]
[null,"ASR-1 MH","Polychlorinated biphenyls (PCBs)",{"$f":"_xlfn.IFNA(IF(VLOOKUP(C81,TACcas,3,FALSE)=\"NoRBC\",\"NoRBC\",VLOOKUP(C81,TACcas,2,FALSE)),\"NoRBC\")","v":"1336-36-3"},9.556274601608369E-3,2.795073200032456E-5]
[null,"ASR-1 MH","Polychlorinated biphenyls (PCBs) TEQ",{"$f":"_xlfn.IFNA(IF(VLOOKUP(C82,TACcas,3,FALSE)=\"NoRBC\",\"NoRBC\",VLOOKUP(C82,TACcas,2,FALSE)),\"NoRBC\")","v":"645"},1.1945343252010466E-7,3.4938415000405698E-10]
[null,"ASR-1 MH","Polychlorinated dibenzo-p-dioxins (PCDDs) & dibenzofurans (PCDFs) TEQ",{"$f":"_xlfn.IFNA(IF(VLOOKUP(C83,TACcas,3,FALSE)=\"NoRBC\",\"NoRBC\",VLOOKUP(C83,TACcas,2,FALSE)),\"NoRBC\")","v":"646"},1.3139877577211508E-7,3.8432256500446261E-10]
[null,"ASR-1 MH","Polychlorinated naphthalenes",{"$f":"_xlfn.IFNA(IF(VLOOKUP(C84,TACcas,3,FALSE)=\"NoRBC\",\"NoRBC\",VLOOKUP(C84,TACcas,2,FALSE)),\"NoRBC\")","v":"NoRBC"},2.2098885016219351E-5,6.4636067750750529E-8]
[null,"ASR-1 MH","Hexachlorobenzene",{"$f":"_xlfn.IFNA(IF(VLOOKUP(C85,TACcas,3,FALSE)=\"NoRBC\",\"NoRBC\",VLOOKUP(C85,TACcas,2,FALSE)),\"NoRBC\")","v":"118-74-1"},6.5699387886057549E-4,1.9216128250223136E-6]
[null,"ASR-1 MH","2,4,6-Trichlorophenol",{"$f":"_xlfn.IFNA(IF(VLOOKUP(C86,TACcas,3,FALSE)=\"NoRBC\",\"NoRBC\",VLOOKUP(C86,TACcas,2,FALSE)),\"NoRBC\")","v":"88-06-2"},13.589999999999998,3.9748799999999994E-2]
[null,"ASR-1 MH","PBDDs/PBDFs",{"$f":"_xlfn.IFNA(IF(VLOOKUP(C87,TACcas,3,FALSE)=\"NoRBC\",\"NoRBC\",VLOOKUP(C87,TACcas,2,FALSE)),\"NoRBC\")","v":"NoRBC"},3.882236556903401E-5,1.1354984875131853E-7]
[null,"ASR-1 MH","Polybrominated diphenyl ethers (PBDEs)",{"$f":"_xlfn.IFNA(IF(VLOOKUP(C88,TACcas,3,FALSE)=\"NoRBC\",\"NoRBC\",VLOOKUP(C88,TACcas,2,FALSE)),\"NoRBC\")","v":"447"},0.10452175345509154,3.0571113125354987E-4]
[null,"ASR-1 MH","Tetrabromobisphenol A",{"$f":"_xlfn.IFNA(IF(VLOOKUP(C89,TACcas,3,FALSE)=\"NoRBC\",\"NoRBC\",VLOOKUP(C89,TACcas,2,FALSE)),\"NoRBC\")","v":"NoRBC"},7.9501499999999998,2.3253047999999998E-2]
[null,"ASR-1 MH","Hexabromocyclododecane",{"$f":"_xlfn.IFNA(IF(VLOOKUP(C90,TACcas,3,FALSE)=\"NoRBC\",\"NoRBC\",VLOOKUP(C90,TACcas,2,FALSE)),\"NoRBC\")","v":"NoRBC"},1.9978586588987497E-3,5.8434499088178535E-6]
[null,"ASR-1 MH","2,4,6-Tribromophenol",{"$f":"_xlfn.IFNA(IF(VLOOKUP(C91,TACcas,3,FALSE)=\"NoRBC\",\"NoRBC\",VLOOKUP(C91,TACcas,2,FALSE)),\"NoRBC\")","v":"NoRBC"},1.68516,4.9288511999999998E-3]
[null,"ASR-1 MH","Polycyclic aromatic hydrocarbons (PAHs)",{"$f":"_xlfn.IFNA(IF(VLOOKUP(C92,TACcas,3,FALSE)=\"NoRBC\",\"NoRBC\",VLOOKUP(C92,TACcas,2,FALSE)),\"NoRBC\")","v":"401"},1.7888151519885664E-2,5.2320276463107521E-5]
[null,"ASR-1 MH","Bis(2-ethylhexyl) phthalate (DEHP)",{"$f":"_xlfn.IFNA(IF(VLOOKUP(C93,TACcas,3,FALSE)=\"NoRBC\",\"NoRBC\",VLOOKUP(C93,TACcas,2,FALSE)),\"NoRBC\")","v":"117-81-7"},4.9573174495843421E-3,1.4499442225168363E-5]
[null,"ASR-1 Piles","Aluminum and compounds",{"$f":"_xlfn.IFNA(IF(VLOOKUP(C94,TACcas,3,FALSE)=\"NoRBC\",\"NoRBC\",VLOOKUP(C94,TACcas,2,FALSE)),\"NoRBC\")","v":"7429-90-5"},7.2233774354442462E-2,1.9790075165600676E-4]
[null,"ASR-1 Piles","Arsenic and compounds",{"$f":"_xlfn.IFNA(IF(VLOOKUP(C95,TACcas,3,FALSE)=\"NoRBC\",\"NoRBC\",VLOOKUP(C95,TACcas,2,FALSE)),\"NoRBC\")","v":"7440-38-2"},1.4685392498997194E-4,4.0233952052047114E-7]
[null,"ASR-1 Piles","Barium and compounds",{"$f":"_xlfn.IFNA(IF(VLOOKUP(C96,TACcas,3,FALSE)=\"NoRBC\",\"NoRBC\",VLOOKUP(C96,TACcas,2,FALSE)),\"NoRBC\")","v":"NoRBC"},3.1665377575962702E-4,8.6754459112226585E-7]
[null,"ASR-1 Piles","Cadmium and compounds",{"$f":"_xlfn.IFNA(IF(VLOOKUP(C97,TACcas,3,FALSE)=\"NoRBC\",\"NoRBC\",VLOOKUP(C97,TACcas,2,FALSE)),\"NoRBC\")","v":"7440-43-9"},2.3313060592158047E-4,6.3871398882624797E-7]
[null,"ASR-1 Piles","Cobalt and compounds",{"$f":"_xlfn.IFNA(IF(VLOOKUP(C98,TACcas,3,FALSE)=\"NoRBC\",\"NoRBC\",VLOOKUP(C98,TACcas,2,FALSE)),\"NoRBC\")","v":"7440-48-4"},2.0100630983002412E-4,5.5070221871239481E-7]
[null,"ASR-1 Piles","Copper and compounds",{"$f":"_xlfn.IFNA(IF(VLOOKUP(C99,TACcas,3,FALSE)=\"NoRBC\",\"NoRBC\",VLOOKUP(C99,TACcas,2,FALSE)),\"NoRBC\")","v":"7440-50-8"},0.32454717422783802,8.8917034035024126E-4]
[null,"ASR-1 Piles","Lead and compounds",{"$f":"_xlfn.IFNA(IF(VLOOKUP(C100,TACcas,3,FALSE)=\"NoRBC\",\"NoRBC\",VLOOKUP(C100,TACcas,2,FALSE)),\"NoRBC\")","v":"7439-92-1"},0.10646909561772966,2.9169615237734152E-4]
[null,"ASR-1 Piles","Manganese and compounds",{"$f":"_xlfn.IFNA(IF(VLOOKUP(C101,TACcas,3,FALSE)=\"NoRBC\",\"NoRBC\",VLOOKUP(C101,TACcas,2,FALSE)),\"NoRBC\")","v":"7439-96-5"},5.0205685605946649E-3,1.3754982357793605E-5]
[null,"ASR-1 Piles","Mercury and compounds",{"$f":"_xlfn.IFNA(IF(VLOOKUP(C102,TACcas,3,FALSE)=\"NoRBC\",\"NoRBC\",VLOOKUP(C102,TACcas,2,FALSE)),\"NoRBC\")","v":"7439-97-6"},5.9659407027176109E-6,1.6345043021144138E-8]
[null,"ASR-1 Piles","Nickel compounds, insoluble",{"$f":"_xlfn.IFNA(IF(VLOOKUP(C103,TACcas,3,FALSE)=\"NoRBC\",\"NoRBC\",VLOOKUP(C103,TACcas,2,FALSE)),\"NoRBC\")","v":"365"},3.5795644216305663E-3,9.8070258126864824E-6]
[null,"ASR-1 Piles","Zinc and compounds",{"$f":"_xlfn.IFNA(IF(VLOOKUP(C104,TACcas,3,FALSE)=\"NoRBC\",\"NoRBC\",VLOOKUP(C104,TACcas,2,FALSE)),\"NoRBC\")","v":"NoRBC"},0.10738693264891699,2.9421077438059452E-4]
[null,"ASR-1 Piles","Polychlorinated biphenyls (PCBs)",{"$f":"_xlfn.IFNA(IF(VLOOKUP(C105,TACcas,3,FALSE)=\"NoRBC\",\"NoRBC\",VLOOKUP(C105,TACcas,2,FALSE)),\"NoRBC\")","v":"1336-36-3"},1.4685392498997194E-4,4.0233952052047114E-7]
[null,"ASR-1 Piles","Polychlorinated biphenyls (PCBs) TEQ",{"$f":"_xlfn.IFNA(IF(VLOOKUP(C106,TACcas,3,FALSE)=\"NoRBC\",\"NoRBC\",VLOOKUP(C106,TACcas,2,FALSE)),\"NoRBC\")","v":"645"},1.8356740623746497E-9,5.0292440065058886E-12]
[null,"ASR-1 Piles","Polychlorinated dibenzo-p-dioxins (PCDDs) & dibenzofurans (PCDFs) TEQ",{"$f":"_xlfn.IFNA(IF(VLOOKUP(C107,TACcas,3,FALSE)=\"NoRBC\",\"NoRBC\",VLOOKUP(C107,TACcas,2,FALSE)),\"NoRBC\")","v":"646"},2.0192414686121145E-9,5.532168407156478E-12]
[null,"ASR-1 Piles","Polychlorinated naphthalenes",{"$f":"_xlfn.IFNA(IF(VLOOKUP(C108,TACcas,3,FALSE)=\"NoRBC\",\"NoRBC\",VLOOKUP(C108,TACcas,2,FALSE)),\"NoRBC\")","v":"NoRBC"},3.3959970153931014E-7,9.3041014120358946E-10]
[null,"ASR-1 Piles","Hexachlorobenzene",{"$f":"_xlfn.IFNA(IF(VLOOKUP(C109,TACcas,3,FALSE)=\"NoRBC\",\"NoRBC\",VLOOKUP(C109,TACcas,2,FALSE)),\"NoRBC\")","v":"118-74-1"},1.0096207343060572E-5,2.7660842035782392E-8]
[null,"ASR-1 Piles","PBDDs/PBDFs",{"$f":"_xlfn.IFNA(IF(VLOOKUP(C110,TACcas,3,FALSE)=\"NoRBC\",\"NoRBC\",VLOOKUP(C110,TACcas,2,FALSE)),\"NoRBC\")","v":"NoRBC"},5.9659407027176112E-7,1.6345043021144141E-9]
[null,"ASR-1 Piles","Polybrominated diphenyl ethers (PBDEs)",{"$f":"_xlfn.IFNA(IF(VLOOKUP(C111,TACcas,3,FALSE)=\"NoRBC\",\"NoRBC\",VLOOKUP(C111,TACcas,2,FALSE)),\"NoRBC\")","v":"447"},1.6062148045778183E-3,4.4005885056926527E-6]
[null,"ASR-1 Piles","Hexabromocyclododecane",{"$f":"_xlfn.IFNA(IF(VLOOKUP(C112,TACcas,3,FALSE)=\"NoRBC\",\"NoRBC\",VLOOKUP(C112,TACcas,2,FALSE)),\"NoRBC\")","v":"NoRBC"},3.0701648693216015E-5,8.4114106008810991E-8]
[null,"ASR-1 Piles","Polycyclic aromatic hydrocarbons (PAHs)",{"$f":"_xlfn.IFNA(IF(VLOOKUP(C113,TACcas,3,FALSE)=\"NoRBC\",\"NoRBC\",VLOOKUP(C113,TACcas,2,FALSE)),\"NoRBC\")","v":"401"},2.7489219084060373E-4,7.5312928997425686E-7]
[null,"ASR-1 Piles","Bis(2-ethylhexyl) phthalate (DEHP)",{"$f":"_xlfn.IFNA(IF(VLOOKUP(C114,TACcas,3,FALSE)=\"NoRBC\",\"NoRBC\",VLOOKUP(C114,TACcas,2,FALSE)),\"NoRBC\")","v":"117-81-7"},7.6180473588547955E-5,2.0871362626999439E-7]
[null,"Drain","2,2,4 Trimethylpentane",{"$f":"_xlfn.IFNA(IF(VLOOKUP(C115,TACcas,3,FALSE)=\"NoRBC\",\"NoRBC\",VLOOKUP(C115,TACcas,2,FALSE)),\"NoRBC\")","v":"NoRBC"},15.892350863403442,4.6482845916059654E-2]
[null,"Drain","Benzene",{"$f":"_xlfn.IFNA(IF(VLOOKUP(C116,TACcas,3,FALSE)=\"NoRBC\",\"NoRBC\",VLOOKUP(C116,TACcas,2,FALSE)),\"NoRBC\")","v":"71-43-2"},13.447373807495222,3.9331638852050474E-2]
[null,"Drain","Ethylbenzene",{"$f":"_xlfn.IFNA(IF(VLOOKUP(C117,TACcas,3,FALSE)=\"NoRBC\",\"NoRBC\",VLOOKUP(C117,TACcas,2,FALSE)),\"NoRBC\")","v":"NoRBC"},3.0562213198852772,8.939008830011471E-3]
[null,"Drain","Hexane",{"$f":"_xlfn.IFNA(IF(VLOOKUP(C118,TACcas,3,FALSE)=\"NoRBC\",\"NoRBC\",VLOOKUP(C118,TACcas,2,FALSE)),\"NoRBC\")","v":"110-54-3"},26.894747614990443,7.8663277704100948E-2]
[null,"Drain","Toluene",{"$f":"_xlfn.IFNA(IF(VLOOKUP(C119,TACcas,3,FALSE)=\"NoRBC\",\"NoRBC\",VLOOKUP(C119,TACcas,2,FALSE)),\"NoRBC\")","v":"108-88-3"},24.449770559082218,7.1512070640091768E-2]
[null,"Drain","Xylenes",{"$f":"_xlfn.IFNA(IF(VLOOKUP(C120,TACcas,3,FALSE)=\"NoRBC\",\"NoRBC\",VLOOKUP(C120,TACcas,2,FALSE)),\"NoRBC\")","v":"NoRBC"},9.1686639596558308,2.6817026490034413E-2]

{"sheet":"Identify Exposure Locations","index":2,"n_rows":11,"n_cols":10,"rows_kept":11,"cut":false,"hidden":false,"merged":[]}
[]
[null,"Exposure Locations"]
[null,"A map with the TEI and each Exposure Location labeled should be included with the submission."]
[]
[]
[null,"TEU Identifier","Residential Exposure Name","Distance (m)","Child Exposure Name","Distance (m)","Work Exposure Name","Distance (m)","Acute Exposure Name","Distance (m)"]
[null,"Shredder-1","Ridgecrest Timber Apartments",736,"Sitton School",955,"It's a better deal auto and truck recycling",30,"It's a better deal auto and truck recycling",30]
[null,"Diesel Engine-1","Ridgecrest Timber Apartments",736,"Sitton School",955,"It's a better deal auto and truck recycling",30,"It's a better deal auto and truck recycling",30]
[null,"ASR-1 MH","Ridgecrest Timber Apartments",736,"Sitton School",955,"It's a better deal auto and truck recycling",30,"It's a better deal auto and truck recycling",30]
[null,"ASR-1 Piles","Ridgecrest Timber Apartments",736,"Sitton School",955,"It's a better deal auto and truck recycling",30,"It's a better deal auto and truck recycling",30]
[null,"Drain","Ridgecrest Timber Apartments",736,"Sitton School",955,"It's a better deal auto and truck recycling",30,"It's a better deal auto and truck recycling",30]

{"sheet":"Summarize Risk","index":3,"n_rows":12,"n_cols":9,"rows_kept":12,"cut":false,"hidden":false,"merged":[[4,2,4,4],[4,5,4,7],[4,8,5,8],[4,1,5,1]]}
[]
[null,"Summary of Risk"]
[]
[]
[null,"TEU Identifier","Cancer Risk",null,null,"Chronic Risk",null,null,"Acute"]
[null,null,"Residential","Child","Worker","Residential","Child","Worker"]
[null,"Shredder-1",{"$f":"SUMIF('Calculate Risk'!$B$7:$B$120,$B7,'Calculate Risk'!L$7:L$120)","v":1.3722105574969714},{"$f":"SUMIF('Calculate Risk'!$B$7:$B$120,$B7,'Calculate Risk'!M$7:M$120)","v":3.3053891188951141E-2},{"$f":"SUMIF('Calculate Risk'!$B$7:$B$120,$B7,'Calculate Risk'!N$7:N$120)","v":4.5789868486964709},{"$f":"SUMIF('Calculate Risk'!$B$7:$B$120,$B7,'Calculate Risk'!O$7:O$120)","v":6.1719888585441453E-3},{"$f":"SUMIF('Calculate Risk'!$B$7:$B$120,$B7,'Calculate Risk'!P$7:P$120)","v":3.9600728888215445E-4},{"$f":"SUMIF('Calculate Risk'!$B$7:$B$120,$B7,'Calculate Risk'!Q$7:Q$120)","v":6.0001104376083997E-2},{"$f":"SUMIF('Calculate Risk'!$B$7:$B$120,$B7,'Calculate Risk'!R$7:R$120)","v":0.31690004362939861}]
[null,"Diesel Engine-1",{"$f":"SUMIF('Calculate Risk'!$B$7:$B$120,$B8,'Calculate Risk'!L$7:L$120)","v":2.7197973602444767},{"$f":"SUMIF('Calculate Risk'!$B$7:$B$120,$B8,'Calculate Risk'!M$7:M$120)","v":4.8977536801118986E-2},{"$f":"SUMIF('Calculate Risk'!$B$7:$B$120,$B8,'Calculate Risk'!N$7:N$120)","v":5.4931475241384584},{"$f":"SUMIF('Calculate Risk'!$B$7:$B$120,$B8,'Calculate Risk'!O$7:O$120)","v":3.2518531299019299E-2},{"$f":"SUMIF('Calculate Risk'!$B$7:$B$120,$B8,'Calculate Risk'!P$7:P$120)","v":2.1864204607617444E-3},{"$f":"SUMIF('Calculate Risk'!$B$7:$B$120,$B8,'Calculate Risk'!Q$7:Q$120)","v":0.29753350600056727},{"$f":"SUMIF('Calculate Risk'!$B$7:$B$120,$B8,'Calculate Risk'!R$7:R$120)","v":0.378579423389521}]
[null,"ASR-1 MH",{"$f":"SUMIF('Calculate Risk'!$B$7:$B$120,$B9,'Calculate Risk'!L$7:L$120)","v":6.5565159412834528E-2},{"$f":"SUMIF('Calculate Risk'!$B$7:$B$120,$B9,'Calculate Risk'!M$7:M$120)","v":1.0601967665775157E-3},{"$f":"SUMIF('Calculate Risk'!$B$7:$B$120,$B9,'Calculate Risk'!N$7:N$120)","v":0.26297631004329336},{"$f":"SUMIF('Calculate Risk'!$B$7:$B$120,$B9,'Calculate Risk'!O$7:O$120)","v":5.8444598488789287E-3},{"$f":"SUMIF('Calculate Risk'!$B$7:$B$120,$B9,'Calculate Risk'!P$7:P$120)","v":5.8573934369093872E-4},{"$f":"SUMIF('Calculate Risk'!$B$7:$B$120,$B9,'Calculate Risk'!Q$7:Q$120)","v":8.8748385407717983E-2},{"$f":"SUMIF('Calculate Risk'!$B$7:$B$120,$B9,'Calculate Risk'!R$7:R$120)","v":0.6911190766301053}]
[null,"ASR-1 Piles",{"$f":"SUMIF('Calculate Risk'!$B$7:$B$120,$B10,'Calculate Risk'!L$7:L$120)","v":8.1756543582855697E-4},{"$f":"SUMIF('Calculate Risk'!$B$7:$B$120,$B10,'Calculate Risk'!M$7:M$120)","v":1.1511719664367304E-5},{"$f":"SUMIF('Calculate Risk'!$B$7:$B$120,$B10,'Calculate Risk'!N$7:N$120)","v":2.4717875758875499E-3},{"$f":"SUMIF('Calculate Risk'!$B$7:$B$120,$B10,'Calculate Risk'!O$7:O$120)","v":8.9797634817875006E-5},{"$f":"SUMIF('Calculate Risk'!$B$7:$B$120,$B10,'Calculate Risk'!P$7:P$120)","v":8.9988335078564924E-6},{"$f":"SUMIF('Calculate Risk'!$B$7:$B$120,$B10,'Calculate Risk'!Q$7:Q$120)","v":1.3634596224024989E-3},{"$f":"SUMIF('Calculate Risk'!$B$7:$B$120,$B10,'Calculate Risk'!R$7:R$120)","v":9.947907007494327E-3}]
[null,"Drain",{"$f":"SUMIF('Calculate Risk'!$B$7:$B$120,$B11,'Calculate Risk'!L$7:L$120)","v":4.6962366989252539E-3},{"$f":"SUMIF('Calculate Risk'!$B$7:$B$120,$B11,'Calculate Risk'!M$7:M$120)","v":1.2102636426745698E-4},{"$f":"SUMIF('Calculate Risk'!$B$7:$B$120,$B11,'Calculate Risk'!N$7:N$120)","v":4.0342121422485659E-2},{"$f":"SUMIF('Calculate Risk'!$B$7:$B$120,$B11,'Calculate Risk'!O$7:O$120)","v":2.0546991069160972E-4},{"$f":"SUMIF('Calculate Risk'!$B$7:$B$120,$B11,'Calculate Risk'!P$7:P$120)","v":3.1012753307133984E-5},{"$f":"SUMIF('Calculate Risk'!$B$7:$B$120,$B11,'Calculate Risk'!Q$7:Q$120)","v":4.6989020162324221E-3},{"$f":"SUMIF('Calculate Risk'!$B$7:$B$120,$B11,'Calculate Risk'!R$7:R$120)","v":6.5558320869283579E-3}]
[null,"Total Risk",{"$f":"SUM(C7:C11)","v":4.1630868792890361},{"$f":"SUM(D7:D11)","v":8.3224162840579458E-2},{"$f":"SUM(E7:E11)","v":10.377924591876596},{"$f":"SUM(F7:F11)","v":4.4830247551951856E-2},{"$f":"SUM(G7:G11)","v":3.2081786801498283E-3},{"$f":"SUM(H7:H11)","v":0.45234535742300414},{"$f":"SUM(I7:I11)","v":1.4031022827434476}]

{"sheet":"Calculate Dispersion Factors","index":4,"n_rows":11,"n_cols":7,"rows_kept":11,"cut":false,"hidden":false,"merged":[[4,2,5,2],[4,1,5,1]]}
[]
[null,"Dispersion Factors"]
[]
[]
[null,"TEU","Type","DF Residential ","DF Child","DF Worker","DF Acute"]
[null,null,null,"ug/m3/lbs/yr","ug/m3/lbs/yr","ug/m3/lbs/yr","ug/m3/lbs/yr"]
[null,"Shredder-1","Fugitive",4.5399999999999999E-5,2.9699999999999997E-5,4.4999999999999997E-3,4.8]
[null,"Diesel Engine-1","Point",3.7120000000000004E-5,2.425E-5,3.3E-3,8.3000000000000007]
[null,"ASR-1 MH","Fugitive",4.5399999999999999E-5,2.9699999999999997E-5,4.4999999999999997E-3,4.8]
[null,"ASR-1 Piles","Fugitive",4.5399999999999999E-5,2.9699999999999997E-5,4.4999999999999997E-3,4.8]
[null,"Drain","Fugitive",4.5399999999999999E-5,2.9699999999999997E-5,4.4999999999999997E-3,4.8]

{"sheet":"Calculate Risk","index":5,"n_rows":120,"n_cols":18,"rows_kept":120,"cut":false,"hidden":false,"merged":[[4,17,5,17],[4,7,4,9],[4,10,5,10],[4,4,4,6],[4,1,5,1],[4,2,5,2],[4,3,5,3],[4,11,4,13],[4,14,4,16]]}
[]
[null,"Risk Calculations"]
[]
[]
[null,"TEU Identifier","TAC","CAS Number","Cancer RBC",null,null,"Chronic RBC",null,null,"Acute RBC","Cancer Risk",null,null,"Chronic Risk",null,null,"Acute"]
[null,null,null,null,"Residential","Child","Worker","Residential","Child","Worker",null,"Residential","Child","Worker","Residential","Child","Worker"]
[null,"Shredder-1","Antimony and compounds","7440-36-0","--","--","--",0.3,1.3,1.3,1,"--","--","--",{"$f":"'Identify Toxic Air Contaminants'!$E7*VLOOKUP($B7,'Calculate Dispersion Factors'!$B$7:$N$11,3,FALSE)/H7","v":7.6437709999999998E-7},{"$f":"'Identify Toxic Air Contaminants'!$E7*VLOOKUP($B7,'Calculate Dispersion Factors'!$B$7:$N$11,4,FALSE)/I7","v":1.1539478076923074E-7},{"$f":"'Identify Toxic Air Contaminants'!$E7*VLOOKUP($B7,'Calculate Dispersion Factors'!$B$7:$N$11,5,FALSE)/J7","v":1.7484057692307688E-5},{"$f":"'Identify Toxic Air Contaminants'!$F7*VLOOKUP($B7,'Calculate Dispersion Factors'!$B$7:$N$11,6,FALSE)/K7","v":7.0911859199999979E-5}]
[null,"Shredder-1","Arsenic and compounds","7440-38-2",2.4000000000000001E-5,1.2999999999999999E-3,6.2E-4,1.7000000000000001E-4,2.3999999999999998E-3,2.3999999999999998E-3,0.2,{"$f":"'Identify Toxic Air Contaminants'!$E8*VLOOKUP($B8,'Calculate Dispersion Factors'!$B$7:$N$11,3,FALSE)/E8","v":2.999960894825703E-3},{"$f":"'Identify Toxic Air Contaminants'!$E8*VLOOKUP($B8,'Calculate Dispersion Factors'!$B$7:$N$11,4,FALSE)/F8","v":3.6231313551876675E-5},{"$f":"'Identify Toxic Air Contaminants'!$E8*VLOOKUP($B8,'Calculate Dispersion Factors'!$B$7:$N$11,5,FALSE)/G8","v":1.1510436856656812E-2},{"$f":"'Identify Toxic Air Contaminants'!$E8*VLOOKUP($B8,'Calculate Dispersion Factors'!$B$7:$N$11,3,FALSE)/H8","v":4.2352389103421687E-4},{"$f":"'Identify Toxic Air Contaminants'!$E8*VLOOKUP($B8,'Calculate Dispersion Factors'!$B$7:$N$11,4,FALSE)/I8","v":1.9625294840599864E-5},{"$f":"'Identify Toxic Air Contaminants'!$E8*VLOOKUP($B8,'Calculate Dispersion Factors'!$B$7:$N$11,5,FALSE)/J8","v":2.9735295213030098E-3},{"$f":"'Identify Toxic Air Contaminants'!$F8*VLOOKUP($B8,'Calculate Dispersion Factors'!$B$7:$N$11,6,FALSE)/K8","v":1.1132348396067137E-4}]
[null,"Shredder-1","Barium and compounds","NoRBC","--","--","--","--","--","--","--"]
[null,"Shredder-1","Beryllium and compounds","7440-41-7",4.2000000000000002E-4,1.0999999999999999E-2,5.0000000000000001E-3,7.0000000000000001E-3,3.1E-2,3.1E-2,0.02,{"$f":"'Identify Toxic Air Contaminants'!$E10*VLOOKUP($B10,'Calculate Dispersion Factors'!$B$7:$N$11,3,FALSE)/E10","v":3.5865793879375165E-5},{"$f":"'Identify Toxic Air Contaminants'!$E10*VLOOKUP($B10,'Calculate Dispersion Factors'!$B$7:$N$11,4,FALSE)/F10","v":8.9585485152448099E-7},{"$f":"'Identify Toxic Air Contaminants'!$E10*VLOOKUP($B10,'Calculate Dispersion Factors'!$B$7:$N$11,5,FALSE)/G10","v":2.9861828384149366E-4},{"$f":"'Identify Toxic Air Contaminants'!$E10*VLOOKUP($B10,'Calculate Dispersion Factors'!$B$7:$N$11,3,FALSE)/H10","v":2.1519476327625097E-6},{"$f":"'Identify Toxic Air Contaminants'!$E10*VLOOKUP($B10,'Calculate Dispersion Factors'!$B$7:$N$11,4,FALSE)/I10","v":3.1788397957320294E-7},{"$f":"'Identify Toxic Air Contaminants'!$E10*VLOOKUP($B10,'Calculate Dispersion Factors'!$B$7:$N$11,5,FALSE)/J10","v":4.8164239329273171E-5},{"$f":"'Identify Toxic Air Contaminants'!$F10*VLOOKUP($B10,'Calculate Dispersion Factors'!$B$7:$N$11,6,FALSE)/K10","v":2.3291083523686556E-4}]
[null,"Shredder-1","Cadmium and compounds","7440-43-9",5.5999999999999995E-4,1.4E-2,6.7000000000000002E-3,5.0000000000000001E-3,3.6999999999999998E-2,3.6999999999999998E-2,0.03,{"$f":"'Identify Toxic Air Contaminants'!$E11*VLOOKUP($B11,'Calculate Dispersion Factors'!$B$7:$N$11,3,FALSE)/E11","v":1.4157625178571429E-2},{"$f":"'Identify Toxic Air Contaminants'!$E11*VLOOKUP($B11,'Calculate Dispersion Factors'!$B$7:$N$11,4,FALSE)/F11","v":3.7046825357142855E-4},{"$f":"'Identify Toxic Air Contaminants'!$E11*VLOOKUP($B11,'Calculate Dispersion Factors'!$B$7:$N$11,5,FALSE)/G11","v":0.11728981343283582},{"$f":"'Identify Toxic Air Contaminants'!$E11*VLOOKUP($B11,'Calculate Dispersion Factors'!$B$7:$N$11,3,FALSE)/H11","v":1.5856540199999998E-3},{"$f":"'Identify Toxic Air Contaminants'!$E11*VLOOKUP($B11,'Calculate Dispersion Factors'!$B$7:$N$11,4,FALSE)/I11","v":1.4017717702702703E-4},{"$f":"'Identify Toxic Air Contaminants'!$E11*VLOOKUP($B11,'Calculate Dispersion Factors'!$B$7:$N$11,5,FALSE)/J11","v":2.1238966216216217E-2},{"$f":"'Identify Toxic Air Contaminants'!$F11*VLOOKUP($B11,'Calculate Dispersion Factors'!$B$7:$N$11,6,FALSE)/K11","v":8.1723532799999998E-2}]
[null,"Shredder-1","Chromium VI, chromate, and dichromate particulate","18540-29-9",3.1000000000000001E-5,5.1999999999999995E-4,1E-3,8.3000000000000004E-2,0.88,0.88,0.3,{"$f":"'Identify Toxic Air Contaminants'!$E12*VLOOKUP($B12,'Calculate Dispersion Factors'!$B$7:$N$11,3,FALSE)/E12","v":0.54732629032258062},{"$f":"'Identify Toxic Air Contaminants'!$E12*VLOOKUP($B12,'Calculate Dispersion Factors'!$B$7:$N$11,4,FALSE)/F12","v":2.1345447115384615E-2},{"$f":"'Identify Toxic Air Contaminants'!$E12*VLOOKUP($B12,'Calculate Dispersion Factors'!$B$7:$N$11,5,FALSE)/G12","v":1.6817624999999998},{"$f":"'Identify Toxic Air Contaminants'!$E12*VLOOKUP($B12,'Calculate Dispersion Factors'!$B$7:$N$11,3,FALSE)/H12","v":2.0442307228915661E-4},{"$f":"'Identify Toxic Air Contaminants'!$E12*VLOOKUP($B12,'Calculate Dispersion Factors'!$B$7:$N$11,4,FALSE)/I12","v":1.2613218749999998E-5},{"$f":"'Identify Toxic Air Contaminants'!$E12*VLOOKUP($B12,'Calculate Dispersion Factors'!$B$7:$N$11,5,FALSE)/J12","v":1.9110937499999998E-3},{"$f":"'Identify Toxic Air Contaminants'!$F12*VLOOKUP($B12,'Calculate Dispersion Factors'!$B$7:$N$11,6,FALSE)/K12","v":1.7489471999999999E-2}]
[null,"Shredder-1","Cobalt and compounds","7440-48-4","--","--","--",0.1,0.44,0.44,"--","--","--","--",{"$f":"'Identify Toxic Air Contaminants'!$E13*VLOOKUP($B13,'Calculate Dispersion Factors'!$B$7:$N$11,3,FALSE)/H13","v":1.3779353999999998E-6},{"$f":"'Identify Toxic Air Contaminants'!$E13*VLOOKUP($B13,'Calculate Dispersion Factors'!$B$7:$N$11,4,FALSE)/I13","v":2.0486924999999999E-7},{"$f":"'Identify Toxic Air Contaminants'!$E13*VLOOKUP($B13,'Calculate Dispersion Factors'!$B$7:$N$11,5,FALSE)/J13","v":3.1040795454545454E-5},"--"]
[null,"Shredder-1","Copper and compounds","7440-50-8","--","--","--","--","--","--",100,"--","--","--","--","--","--",{"$f":"'Identify Toxic Air Contaminants'!$F14*VLOOKUP($B14,'Calculate Dispersion Factors'!$B$7:$N$11,6,FALSE)/K14","v":4.9108657463501845E-6}]
[null,"Shredder-1","Lead and compounds","7439-92-1","--","--","--",0.15,0.66,0.66,0.15,"--","--","--",{"$f":"'Identify Toxic Air Contaminants'!$E15*VLOOKUP($B15,'Calculate Dispersion Factors'!$B$7:$N$11,3,FALSE)/H15","v":5.2923688000000016E-4},{"$f":"'Identify Toxic Air Contaminants'!$E15*VLOOKUP($B15,'Calculate Dispersion Factors'!$B$7:$N$11,4,FALSE)/I15","v":7.8686100000000005E-5},{"$f":"'Identify Toxic Air Contaminants'!$E15*VLOOKUP($B15,'Calculate Dispersion Factors'!$B$7:$N$11,5,FALSE)/J15","v":1.1922136363636362E-2},{"$f":"'Identify Toxic Air Contaminants'!$F15*VLOOKUP($B15,'Calculate Dispersion Factors'!$B$7:$N$11,6,FALSE)/K15","v":0.16365905920000001}]
[null,"Shredder-1","Manganese and compounds","7439-96-5","--","--","--",0.09,0.4,0.4,0.3,"--","--","--",{"$f":"'Identify Toxic Air Contaminants'!$E16*VLOOKUP($B16,'Calculate Dispersion Factors'!$B$7:$N$11,3,FALSE)/H16","v":2.7262055980401895E-5},{"$f":"'Identify Toxic Air Contaminants'!$E16*VLOOKUP($B16,'Calculate Dispersion Factors'!$B$7:$N$11,4,FALSE)/I16","v":4.0127464557056303E-6},{"$f":"'Identify Toxic Air Contaminants'!$E16*VLOOKUP($B16,'Calculate Dispersion Factors'!$B$7:$N$11,5,FALSE)/J16","v":6.0799188722812582E-4},{"$f":"'Identify Toxic Air Contaminants'!$F16*VLOOKUP($B16,'Calculate Dispersion Factors'!$B$7:$N$11,6,FALSE)/K16","v":2.529122176978846E-3}]
[null,"Shredder-1","Mercury and compounds","7439-97-6","--","--","--",7.6999999999999999E-2,0.63,0.63,0.6,"--","--","--",{"$f":"'Identify Toxic Air Contaminants'!$E17*VLOOKUP($B17,'Calculate Dispersion Factors'!$B$7:$N$11,3,FALSE)/H17","v":6.6315797619800009E-4},{"$f":"'Identify Toxic Air Contaminants'!$E17*VLOOKUP($B17,'Calculate Dispersion Factors'!$B$7:$N$11,4,FALSE)/I17","v":5.3023424088077972E-5},{"$f":"'Identify Toxic Air Contaminants'!$E17*VLOOKUP($B17,'Calculate Dispersion Factors'!$B$7:$N$11,5,FALSE)/J17","v":8.0338521345572692E-3},{"$f":"'Identify Toxic Air Contaminants'!$F17*VLOOKUP($B17,'Calculate Dispersion Factors'!$B$7:$N$11,6,FALSE)/K17","v":2.6317608501340746E-2}]
[null,"Shredder-1","Nickel compounds, insoluble","365",3.8E-3,0.1,4.5999999999999999E-2,1.4E-2,6.2E-2,6.2E-2,0.2,{"$f":"'Identify Toxic Air Contaminants'!$E18*VLOOKUP($B18,'Calculate Dispersion Factors'!$B$7:$N$11,3,FALSE)/E18","v":2.3851872736016224E-4},{"$f":"'Identify Toxic Air Contaminants'!$E18*VLOOKUP($B18,'Calculate Dispersion Factors'!$B$7:$N$11,4,FALSE)/F18","v":5.9293443986493181E-6},{"$f":"'Identify Toxic Air Contaminants'!$E18*VLOOKUP($B18,'Calculate Dispersion Factors'!$B$7:$N$11,5,FALSE)/G18","v":1.9530119890149274E-3},{"$f":"'Identify Toxic Air Contaminants'!$E18*VLOOKUP($B18,'Calculate Dispersion Factors'!$B$7:$N$11,3,FALSE)/H18","v":6.4740797426329755E-5},{"$f":"'Identify Toxic Air Contaminants'!$E18*VLOOKUP($B18,'Calculate Dispersion Factors'!$B$7:$N$11,4,FALSE)/I18","v":9.5634587074989018E-6},{"$f":"'Identify Toxic Air Contaminants'!$E18*VLOOKUP($B18,'Calculate Dispersion Factors'!$B$7:$N$11,5,FALSE)/J18","v":1.4490088950755912E-3},{"$f":"'Identify Toxic Air Contaminants'!$F18*VLOOKUP($B18,'Calculate Dispersion Factors'!$B$7:$N$11,6,FALSE)/K18","v":1.4014126526963946E-3}]
[null,"Shredder-1","Phosphorus and compounds","NoRBC","--","--","--","--","--","--","--"]
[null,"Shredder-1","Selenium and compounds","7782-49-2","--","--","--","--","--","--",2,"--","--","--","--","--","--",{"$f":"'Identify Toxic Air Contaminants'!$F20*VLOOKUP($B20,'Calculate Dispersion Factors'!$B$7:$N$11,6,FALSE)/K20","v":4.7766459429933452E-5}]
[null,"Shredder-1","Thallium and compounds","NoRBC","--","--","--","--","--","--","--"]
[null,"Shredder-1","Silver and compounds","NoRBC","--","--","--","--","--","--","--"]
[null,"Shredder-1","Zinc and compounds","NoRBC","--","--","--","--","--","--","--"]
[null,"Shredder-1","1,1-Dichloroethane (Ethylidene dichloride)","75-34-3",0.63,16,7.5,"--","--","--","--",{"$f":"'Identify Toxic Air Contaminants'!$E24*VLOOKUP($B24,'Calculate Dispersion Factors'!$B$7:$N$11,3,FALSE)/E24","v":2.1708766666666668E-5},{"$f":"'Identify Toxic Air Contaminants'!$E24*VLOOKUP($B24,'Calculate Dispersion Factors'!$B$7:$N$11,4,FALSE)/F24","v":5.5918603125E-7},{"$f":"'Identify Toxic Air Contaminants'!$E24*VLOOKUP($B24,'Calculate Dispersion Factors'!$B$7:$N$11,5,FALSE)/G24","v":1.8074700000000001E-4},"--","--","--","--"]
[null,"Shredder-1","Benzene","71-43-2",0.13,3.3,1.5,3,13,13,29,{"$f":"'Identify Toxic Air Contaminants'!$E25*VLOOKUP($B25,'Calculate Dispersion Factors'!$B$7:$N$11,3,FALSE)/E25","v":9.0086574241394751E-3},{"$f":"'Identify Toxic Air Contaminants'!$E25*VLOOKUP($B25,'Calculate Dispersion Factors'!$B$7:$N$11,4,FALSE)/F25","v":2.3216143582033451E-4},{"$f":"'Identify Toxic Air Contaminants'!$E25*VLOOKUP($B25,'Calculate Dispersion Factors'!$B$7:$N$11,5,FALSE)/G25","v":7.7387145273444841E-2},{"$f":"'Identify Toxic Air Contaminants'!$E25*VLOOKUP($B25,'Calculate Dispersion Factors'!$B$7:$N$11,3,FALSE)/H25","v":3.9037515504604397E-4},{"$f":"'Identify Toxic Air Contaminants'!$E25*VLOOKUP($B25,'Calculate Dispersion Factors'!$B$7:$N$11,4,FALSE)/I25","v":5.8933287554392603E-5},{"$f":"'Identify Toxic Air Contaminants'!$E25*VLOOKUP($B25,'Calculate Dispersion Factors'!$B$7:$N$11,5,FALSE)/J25","v":8.9292859930897896E-3},{"$f":"'Identify Toxic Air Contaminants'!$F25*VLOOKUP($B25,'Calculate Dispersion Factors'!$B$7:$N$11,6,FALSE)/K25","v":1.2488071492913569E-2}]
[null,"Shredder-1","Ethyl benzene","100-41-4",0.4,10,4.8,260,1100,1100,22000,{"$f":"'Identify Toxic Air Contaminants'!$E26*VLOOKUP($B26,'Calculate Dispersion Factors'!$B$7:$N$11,3,FALSE)/E26","v":2.6959076301447098E-3},{"$f":"'Identify Toxic Air Contaminants'!$E26*VLOOKUP($B26,'Calculate Dispersion Factors'!$B$7:$N$11,4,FALSE)/F26","v":7.0544895696297684E-5},{"$f":"'Identify Toxic Air Contaminants'!$E26*VLOOKUP($B26,'Calculate Dispersion Factors'!$B$7:$N$11,5,FALSE)/G26","v":2.226795950009397E-2},{"$f":"'Identify Toxic Air Contaminants'!$E26*VLOOKUP($B26,'Calculate Dispersion Factors'!$B$7:$N$11,3,FALSE)/H26","v":4.1475502002226304E-6},{"$f":"'Identify Toxic Air Contaminants'!$E26*VLOOKUP($B26,'Calculate Dispersion Factors'!$B$7:$N$11,4,FALSE)/I26","v":6.4131723360270624E-7},{"$f":"'Identify Toxic Air Contaminants'!$E26*VLOOKUP($B26,'Calculate Dispersion Factors'!$B$7:$N$11,5,FALSE)/J26","v":9.7169277818591866E-5},{"$f":"'Identify Toxic Air Contaminants'!$F26*VLOOKUP($B26,'Calculate Dispersion Factors'!$B$7:$N$11,6,FALSE)/K26","v":1.5157663733747929E-5}]
[null,"Shredder-1","Hexane","110-54-3","--","--","--",700,3100,3100,"--","--","--","--",{"$f":"'Identify Toxic Air Contaminants'!$E27*VLOOKUP($B27,'Calculate Dispersion Factors'!$B$7:$N$11,3,FALSE)/H27","v":5.0246307085134368E-6},{"$f":"'Identify Toxic Air Contaminants'!$E27*VLOOKUP($B27,'Calculate Dispersion Factors'!$B$7:$N$11,4,FALSE)/I27","v":7.4223442113112376E-7},{"$f":"'Identify Toxic Air Contaminants'!$E27*VLOOKUP($B27,'Calculate Dispersion Factors'!$B$7:$N$11,5,FALSE)/J27","v":1.1245976077744298E-4},"--"]
[null,"Shredder-1","Bromomethane (Methyl bromide)","74-83-9","--","--","--",5,22,22,3900,"--","--","--",{"$f":"'Identify Toxic Air Contaminants'!$E28*VLOOKUP($B28,'Calculate Dispersion Factors'!$B$7:$N$11,3,FALSE)/H28","v":2.6669193760571315E-7},{"$f":"'Identify Toxic Air Contaminants'!$E28*VLOOKUP($B28,'Calculate Dispersion Factors'!$B$7:$N$11,4,FALSE)/I28","v":3.9651334335651181E-8},{"$f":"'Identify Toxic Air Contaminants'!$E28*VLOOKUP($B28,'Calculate Dispersion Factors'!$B$7:$N$11,5,FALSE)/J28","v":6.0077779296441188E-6},{"$f":"'Identify Toxic Air Contaminants'!$F28*VLOOKUP($B28,'Calculate Dispersion Factors'!$B$7:$N$11,6,FALSE)/K28","v":1.0573170456681073E-7}]
[null,"Shredder-1","1,1,1-Trichloroethane (Methyl chloroform)","71-55-6","--","--","--",5000,22000,22000,11000,"--","--","--",{"$f":"'Identify Toxic Air Contaminants'!$E29*VLOOKUP($B29,'Calculate Dispersion Factors'!$B$7:$N$11,3,FALSE)/H29","v":4.1132400000000002E-8},{"$f":"'Identify Toxic Air Contaminants'!$E29*VLOOKUP($B29,'Calculate Dispersion Factors'!$B$7:$N$11,4,FALSE)/I29","v":6.1154999999999994E-9},{"$f":"'Identify Toxic Air Contaminants'!$E29*VLOOKUP($B29,'Calculate Dispersion Factors'!$B$7:$N$11,5,FALSE)/J29","v":9.2659090909090908E-7},{"$f":"'Identify Toxic Air Contaminants'!$F29*VLOOKUP($B29,'Calculate Dispersion Factors'!$B$7:$N$11,6,FALSE)/K29","v":5.7816436363636365E-6}]
[null,"Shredder-1","2-Butanone (Methyl ethyl ketone)","78-93-3","--","--","--",5000,22000,22000,5000,"--","--","--",{"$f":"'Identify Toxic Air Contaminants'!$E30*VLOOKUP($B30,'Calculate Dispersion Factors'!$B$7:$N$11,3,FALSE)/H30","v":1.0961784599999998E-9},{"$f":"'Identify Toxic Air Contaminants'!$E30*VLOOKUP($B30,'Calculate Dispersion Factors'!$B$7:$N$11,4,FALSE)/I30","v":1.6297807499999997E-10},{"$f":"'Identify Toxic Air Contaminants'!$E30*VLOOKUP($B30,'Calculate Dispersion Factors'!$B$7:$N$11,5,FALSE)/J30","v":2.4693647727272725E-8},{"$f":"'Identify Toxic Air Contaminants'!$F30*VLOOKUP($B30,'Calculate Dispersion Factors'!$B$7:$N$11,6,FALSE)/K30","v":3.3897776639999991E-7}]
[null,"Shredder-1","Methyl isobutyl ketone (MIBK, Hexone)","108-10-1","--","--","--",3000,13000,13000,"--","--","--","--",{"$f":"'Identify Toxic Air Contaminants'!$E31*VLOOKUP($B31,'Calculate Dispersion Factors'!$B$7:$N$11,3,FALSE)/H31","v":2.9374764142078555E-8},{"$f":"'Identify Toxic Air Contaminants'!$E31*VLOOKUP($B31,'Calculate Dispersion Factors'!$B$7:$N$11,4,FALSE)/I31","v":4.4345840139938986E-9},{"$f":"'Identify Toxic Air Contaminants'!$E31*VLOOKUP($B31,'Calculate Dispersion Factors'!$B$7:$N$11,5,FALSE)/J31","v":6.7190666878695441E-7},"--"]
[null,"Shredder-1","Dichloromethane (Methylene chloride)","75-09-2",59,620,1200,600,2600,2600,2100,{"$f":"'Identify Toxic Air Contaminants'!$E32*VLOOKUP($B32,'Calculate Dispersion Factors'!$B$7:$N$11,3,FALSE)/E32","v":4.1271412599262904E-6},{"$f":"'Identify Toxic Air Contaminants'!$E32*VLOOKUP($B32,'Calculate Dispersion Factors'!$B$7:$N$11,4,FALSE)/F32","v":2.5692729962231199E-7},{"$f":"'Identify Toxic Air Contaminants'!$E32*VLOOKUP($B32,'Calculate Dispersion Factors'!$B$7:$N$11,5,FALSE)/G32","v":2.0112995677504224E-5},{"$f":"'Identify Toxic Air Contaminants'!$E32*VLOOKUP($B32,'Calculate Dispersion Factors'!$B$7:$N$11,3,FALSE)/H32","v":4.0583555722608523E-7},{"$f":"'Identify Toxic Air Contaminants'!$E32*VLOOKUP($B32,'Calculate Dispersion Factors'!$B$7:$N$11,4,FALSE)/I32","v":6.1267279140705164E-8},{"$f":"'Identify Toxic Air Contaminants'!$E32*VLOOKUP($B32,'Calculate Dispersion Factors'!$B$7:$N$11,5,FALSE)/J32","v":9.2829210819250263E-6},{"$f":"'Identify Toxic Air Contaminants'!$F32*VLOOKUP($B32,'Calculate Dispersion Factors'!$B$7:$N$11,6,FALSE)/K32","v":3.5856838940048857E-5}]
[null,"Shredder-1","Naphthalene","91-20-3",2.9000000000000001E-2,0.76,0.35,3.7,16,16,200,{"$f":"'Identify Toxic Air Contaminants'!$E33*VLOOKUP($B33,'Calculate Dispersion Factors'!$B$7:$N$11,3,FALSE)/E33","v":1.2195058616153304E-3},{"$f":"'Identify Toxic Air Contaminants'!$E33*VLOOKUP($B33,'Calculate Dispersion Factors'!$B$7:$N$11,4,FALSE)/F33","v":3.0441699472793992E-5},{"$f":"'Identify Toxic Air Contaminants'!$E33*VLOOKUP($B33,'Calculate Dispersion Factors'!$B$7:$N$11,5,FALSE)/G33","v":1.0015450908798025E-2},{"$f":"'Identify Toxic Air Contaminants'!$E33*VLOOKUP($B33,'Calculate Dispersion Factors'!$B$7:$N$11,3,FALSE)/H33","v":9.5582891856336701E-6},{"$f":"'Identify Toxic Air Contaminants'!$E33*VLOOKUP($B33,'Calculate Dispersion Factors'!$B$7:$N$11,4,FALSE)/I33","v":1.4459807249577147E-6},{"$f":"'Identify Toxic Air Contaminants'!$E33*VLOOKUP($B33,'Calculate Dispersion Factors'!$B$7:$N$11,5,FALSE)/J33","v":2.1908798862995679E-4},{"$f":"'Identify Toxic Air Contaminants'!$F33*VLOOKUP($B33,'Calculate Dispersion Factors'!$B$7:$N$11,6,FALSE)/K33","v":5.4681679383574518E-5}]
[null,"Shredder-1","Styrene","100-42-5","--","--","--",1000,4400,4400,21000,"--","--","--",{"$f":"'Identify Toxic Air Contaminants'!$E34*VLOOKUP($B34,'Calculate Dispersion Factors'!$B$7:$N$11,3,FALSE)/H34","v":3.6911710204848711E-7},{"$f":"'Identify Toxic Air Contaminants'!$E34*VLOOKUP($B34,'Calculate Dispersion Factors'!$B$7:$N$11,4,FALSE)/I34","v":5.4879745348618671E-8},{"$f":"'Identify Toxic Air Contaminants'!$E34*VLOOKUP($B34,'Calculate Dispersion Factors'!$B$7:$N$11,5,FALSE)/J34","v":8.3151129316088894E-6},{"$f":"'Identify Toxic Air Contaminants'!$F34*VLOOKUP($B34,'Calculate Dispersion Factors'!$B$7:$N$11,6,FALSE)/K34","v":5.4354414583724852E-6}]
[null,"Shredder-1","Tetrachloroethene (Perchloroethylene)","127-18-4",3.8,100,46,41,180,180,41,{"$f":"'Identify Toxic Air Contaminants'!$E35*VLOOKUP($B35,'Calculate Dispersion Factors'!$B$7:$N$11,3,FALSE)/E35","v":5.4925113008041615E-6},{"$f":"'Identify Toxic Air Contaminants'!$E35*VLOOKUP($B35,'Calculate Dispersion Factors'!$B$7:$N$11,4,FALSE)/F35","v":1.3653850779928582E-7},{"$f":"'Identify Toxic Air Contaminants'!$E35*VLOOKUP($B35,'Calculate Dispersion Factors'!$B$7:$N$11,5,FALSE)/G35","v":4.4973158036655415E-5},{"$f":"'Identify Toxic Air Contaminants'!$E35*VLOOKUP($B35,'Calculate Dispersion Factors'!$B$7:$N$11,3,FALSE)/H35","v":5.090620230013613E-7},{"$f":"'Identify Toxic Air Contaminants'!$E35*VLOOKUP($B35,'Calculate Dispersion Factors'!$B$7:$N$11,4,FALSE)/I35","v":7.5854726555158799E-8},{"$f":"'Identify Toxic Air Contaminants'!$E35*VLOOKUP($B35,'Calculate Dispersion Factors'!$B$7:$N$11,5,FALSE)/J35","v":1.1493140387145273E-5},{"$f":"'Identify Toxic Air Contaminants'!$F35*VLOOKUP($B35,'Calculate Dispersion Factors'!$B$7:$N$11,6,FALSE)/K35","v":1.5742026851728766E-4}]
[null,"Shredder-1","Toluene","108-88-3","--","--","--",5000,22000,22000,7500,"--","--","--",{"$f":"'Identify Toxic Air Contaminants'!$E36*VLOOKUP($B36,'Calculate Dispersion Factors'!$B$7:$N$11,3,FALSE)/H36","v":1.1015536553279456E-6},{"$f":"'Identify Toxic Air Contaminants'!$E36*VLOOKUP($B36,'Calculate Dispersion Factors'!$B$7:$N$11,4,FALSE)/I36","v":1.6377725051682012E-7},{"$f":"'Identify Toxic Air Contaminants'!$E36*VLOOKUP($B36,'Calculate Dispersion Factors'!$B$7:$N$11,5,FALSE)/J36","v":2.4814734926790926E-5},{"$f":"'Identify Toxic Air Contaminants'!$F36*VLOOKUP($B36,'Calculate Dispersion Factors'!$B$7:$N$11,6,FALSE)/K36","v":2.2709331328697608E-4}]
[null,"Shredder-1","Trichloroethene (TCE, Trichloroethylene)","79-01-6",0.2,3.5,2.9,2.1,9.1999999999999993,9.1999999999999993,2.1,{"$f":"'Identify Toxic Air Contaminants'!$E37*VLOOKUP($B37,'Calculate Dispersion Factors'!$B$7:$N$11,3,FALSE)/E37","v":3.4294138499999996E-4},{"$f":"'Identify Toxic Air Contaminants'!$E37*VLOOKUP($B37,'Calculate Dispersion Factors'!$B$7:$N$11,4,FALSE)/F37","v":1.2819835285714282E-5},{"$f":"'Identify Toxic Air Contaminants'!$E37*VLOOKUP($B37,'Calculate Dispersion Factors'!$B$7:$N$11,5,FALSE)/G37","v":2.3442749999999998E-3},{"$f":"'Identify Toxic Air Contaminants'!$E37*VLOOKUP($B37,'Calculate Dispersion Factors'!$B$7:$N$11,3,FALSE)/H37","v":3.2661084285714284E-5},{"$f":"'Identify Toxic Air Contaminants'!$E37*VLOOKUP($B37,'Calculate Dispersion Factors'!$B$7:$N$11,4,FALSE)/I37","v":4.8771112499999994E-6},{"$f":"'Identify Toxic Air Contaminants'!$E37*VLOOKUP($B37,'Calculate Dispersion Factors'!$B$7:$N$11,5,FALSE)/J37","v":7.3895625000000001E-4},{"$f":"'Identify Toxic Air Contaminants'!$F37*VLOOKUP($B37,'Calculate Dispersion Factors'!$B$7:$N$11,6,FALSE)/K37","v":1.0099980799999998E-2}]
[null,"Shredder-1","Vinyl Chloride","75-01-4",0.11,0.22,2.7,100,440,440,1300,{"$f":"'Identify Toxic Air Contaminants'!$E38*VLOOKUP($B38,'Calculate Dispersion Factors'!$B$7:$N$11,3,FALSE)/E38","v":3.2150609078949611E-5},{"$f":"'Identify Toxic Air Contaminants'!$E38*VLOOKUP($B38,'Calculate Dispersion Factors'!$B$7:$N$11,4,FALSE)/F38","v":1.0516223454237922E-5},{"$f":"'Identify Toxic Air Contaminants'!$E38*VLOOKUP($B38,'Calculate Dispersion Factors'!$B$7:$N$11,5,FALSE)/G38","v":1.2982991918812249E-4},{"$f":"'Identify Toxic Air Contaminants'!$E38*VLOOKUP($B38,'Calculate Dispersion Factors'!$B$7:$N$11,3,FALSE)/H38","v":3.5365669986844574E-8},{"$f":"'Identify Toxic Air Contaminants'!$E38*VLOOKUP($B38,'Calculate Dispersion Factors'!$B$7:$N$11,4,FALSE)/I38","v":5.2581117271189616E-9},{"$f":"'Identify Toxic Air Contaminants'!$E38*VLOOKUP($B38,'Calculate Dispersion Factors'!$B$7:$N$11,5,FALSE)/J38","v":7.9668359501802447E-7},{"$f":"'Identify Toxic Air Contaminants'!$F38*VLOOKUP($B38,'Calculate Dispersion Factors'!$B$7:$N$11,6,FALSE)/K38","v":8.4125660590114631E-7}]
[null,"Shredder-1","Vinylidene chloride","75-35-4","--","--","--",200,880,880,200,"--","--","--",{"$f":"'Identify Toxic Air Contaminants'!$E39*VLOOKUP($B39,'Calculate Dispersion Factors'!$B$7:$N$11,3,FALSE)/H39","v":1.3721106934786694E-7},{"$f":"'Identify Toxic Air Contaminants'!$E39*VLOOKUP($B39,'Calculate Dispersion Factors'!$B$7:$N$11,4,FALSE)/I39","v":2.0400324187182858E-8},{"$f":"'Identify Toxic Air Contaminants'!$E39*VLOOKUP($B39,'Calculate Dispersion Factors'!$B$7:$N$11,5,FALSE)/J39","v":3.0909582101792211E-6},{"$f":"'Identify Toxic Air Contaminants'!$F39*VLOOKUP($B39,'Calculate Dispersion Factors'!$B$7:$N$11,6,FALSE)/K39","v":4.2430592745724484E-5}]
[null,"Shredder-1","Xylene (mixture), including m-xylene, o-xylene, p-xylene","1330-20-7","--","--","--",220,970,970,8700,"--","--","--",{"$f":"'Identify Toxic Air Contaminants'!$E40*VLOOKUP($B40,'Calculate Dispersion Factors'!$B$7:$N$11,3,FALSE)/H40","v":2.2867340315388428E-5},{"$f":"'Identify Toxic Air Contaminants'!$E40*VLOOKUP($B40,'Calculate Dispersion Factors'!$B$7:$N$11,4,FALSE)/I40","v":3.3928698310719826E-6},{"$f":"'Identify Toxic Air Contaminants'!$E40*VLOOKUP($B40,'Calculate Dispersion Factors'!$B$7:$N$11,5,FALSE)/J40","v":5.14071186526058E-4},{"$f":"'Identify Toxic Air Contaminants'!$F40*VLOOKUP($B40,'Calculate Dispersion Factors'!$B$7:$N$11,6,FALSE)/K40","v":1.7881709411635095E-4}]
[null,"Shredder-1","Polychlorinated biphenyls (PCBs)","1336-36-3",5.2999999999999998E-4,0.02,9.1999999999999998E-3,"--","--","--","--",{"$f":"'Identify Toxic Air Contaminants'!$E41*VLOOKUP($B41,'Calculate Dispersion Factors'!$B$7:$N$11,3,FALSE)/E41","v":0.29297133962264149},{"$f":"'Identify Toxic Air Contaminants'!$E41*VLOOKUP($B41,'Calculate Dispersion Factors'!$B$7:$N$11,4,FALSE)/F41","v":5.0789227499999992E-3},{"$f":"'Identify Toxic Air Contaminants'!$E41*VLOOKUP($B41,'Calculate Dispersion Factors'!$B$7:$N$11,5,FALSE)/G41","v":1.6728994565217392},"--","--","--","--"]
[null,"Shredder-1","Polychlorinated biphenyls (PCBs) TEQ","645",1.0000000000000001E-9,8.9999999999999999E-8,4.1999999999999999E-8,1.3E-7,2.5999999999999998E-5,2.5999999999999998E-5,"--",{"$f":"'Identify Toxic Air Contaminants'!$E42*VLOOKUP($B42,'Calculate Dispersion Factors'!$B$7:$N$11,3,FALSE)/E42","v":0.26838890999999998},{"$f":"'Identify Toxic Air Contaminants'!$E42*VLOOKUP($B42,'Calculate Dispersion Factors'!$B$7:$N$11,4,FALSE)/F42","v":1.9508444999999997E-3},{"$f":"'Identify Toxic Air Contaminants'!$E42*VLOOKUP($B42,'Calculate Dispersion Factors'!$B$7:$N$11,5,FALSE)/G42","v":0.63339107142857132},{"$f":"'Identify Toxic Air Contaminants'!$E42*VLOOKUP($B42,'Calculate Dispersion Factors'!$B$7:$N$11,3,FALSE)/H42","v":2.064530076923077E-3},{"$f":"'Identify Toxic Air Contaminants'!$E42*VLOOKUP($B42,'Calculate Dispersion Factors'!$B$7:$N$11,4,FALSE)/I42","v":6.752923269230768E-6},{"$f":"'Identify Toxic Air Contaminants'!$E42*VLOOKUP($B42,'Calculate Dispersion Factors'!$B$7:$N$11,5,FALSE)/J42","v":1.0231701923076922E-3},"--"]
[null,"Shredder-1","Polychlorinated dibenzo-p-dioxins (PCDDs) & dibenzofurans (PCDFs) TEQ","646",1.0000000000000001E-9,8.9999999999999999E-8,4.1999999999999999E-8,1.3E-7,2.5999999999999998E-5,2.5999999999999998E-5,"--",{"$f":"'Identify Toxic Air Contaminants'!$E43*VLOOKUP($B43,'Calculate Dispersion Factors'!$B$7:$N$11,3,FALSE)/E43","v":1.7892593999999998E-2},{"$f":"'Identify Toxic Air Contaminants'!$E43*VLOOKUP($B43,'Calculate Dispersion Factors'!$B$7:$N$11,4,FALSE)/F43","v":1.3005629999999997E-4},{"$f":"'Identify Toxic Air Contaminants'!$E43*VLOOKUP($B43,'Calculate Dispersion Factors'!$B$7:$N$11,5,FALSE)/G43","v":4.2226071428571425E-2},{"$f":"'Identify Toxic Air Contaminants'!$E43*VLOOKUP($B43,'Calculate Dispersion Factors'!$B$7:$N$11,3,FALSE)/H43","v":1.3763533846153844E-4},{"$f":"'Identify Toxic Air Contaminants'!$E43*VLOOKUP($B43,'Calculate Dispersion Factors'!$B$7:$N$11,4,FALSE)/I43","v":4.501948846153846E-7},{"$f":"'Identify Toxic Air Contaminants'!$E43*VLOOKUP($B43,'Calculate Dispersion Factors'!$B$7:$N$11,5,FALSE)/J43","v":6.8211346153846148E-5},"--"]
[null,"Shredder-1","Polycyclic aromatic hydrocarbons (PAHs)","401",4.3000000000000002E-5,1.6000000000000001E-3,3.0000000000000001E-3,"--","--","--","--",{"$f":"'Identify Toxic Air Contaminants'!$E44*VLOOKUP($B44,'Calculate Dispersion Factors'!$B$7:$N$11,3,FALSE)/E44","v":0.21486896162790692},{"$f":"'Identify Toxic Air Contaminants'!$E44*VLOOKUP($B44,'Calculate Dispersion Factors'!$B$7:$N$11,4,FALSE)/F44","v":3.7776590156249987E-3},{"$f":"'Identify Toxic Air Contaminants'!$E44*VLOOKUP($B44,'Calculate Dispersion Factors'!$B$7:$N$11,5,FALSE)/G44","v":0.30526537499999995},"--","--","--","--"]
[null,"Diesel Engine-1","Benzene","71-43-2",0.13,3.3,1.5,3,13,13,29,{"$f":"'Identify Toxic Air Contaminants'!$E45*VLOOKUP($B45,'Calculate Dispersion Factors'!$B$7:$N$11,3,FALSE)/E45","v":3.8556326990769234E-3},{"$f":"'Identify Toxic Air Contaminants'!$E45*VLOOKUP($B45,'Calculate Dispersion Factors'!$B$7:$N$11,4,FALSE)/F45","v":9.9226767272727289E-5},{"$f":"'Identify Toxic Air Contaminants'!$E45*VLOOKUP($B45,'Calculate Dispersion Factors'!$B$7:$N$11,5,FALSE)/G45","v":2.97066528E-2},{"$f":"'Identify Toxic Air Contaminants'!$E45*VLOOKUP($B45,'Calculate Dispersion Factors'!$B$7:$N$11,3,FALSE)/H45","v":1.6707741696000001E-4},{"$f":"'Identify Toxic Air Contaminants'!$E45*VLOOKUP($B45,'Calculate Dispersion Factors'!$B$7:$N$11,4,FALSE)/I45","v":2.5188333230769232E-5},{"$f":"'Identify Toxic Air Contaminants'!$E45*VLOOKUP($B45,'Calculate Dispersion Factors'!$B$7:$N$11,5,FALSE)/J45","v":3.4276907076923077E-3},{"$f":"'Identify Toxic Air Contaminants'!$F45*VLOOKUP($B45,'Calculate Dispersion Factors'!$B$7:$N$11,6,FALSE)/K45","v":1.1303571853241379E-2}]
[null,"Diesel Engine-1","1,3-Butadiene","106-99-0",3.3000000000000002E-2,0.86,0.4,2,8.8000000000000007,8.8000000000000007,660,{"$f":"'Identify Toxic Air Contaminants'!$E46*VLOOKUP($B46,'Calculate Dispersion Factors'!$B$7:$N$11,3,FALSE)/E46","v":1.7724408552727278E-2},{"$f":"'Identify Toxic Air Contaminants'!$E46*VLOOKUP($B46,'Calculate Dispersion Factors'!$B$7:$N$11,4,FALSE)/F46","v":4.4431504186046516E-4},{"$f":"'Identify Toxic Air Contaminants'!$E46*VLOOKUP($B46,'Calculate Dispersion Factors'!$B$7:$N$11,5,FALSE)/G46","v":0.12999650400000001},{"$f":"'Identify Toxic Air Contaminants'!$E46*VLOOKUP($B46,'Calculate Dispersion Factors'!$B$7:$N$11,3,FALSE)/H46","v":2.9245274112000007E-4},{"$f":"'Identify Toxic Air Contaminants'!$E46*VLOOKUP($B46,'Calculate Dispersion Factors'!$B$7:$N$11,4,FALSE)/I46","v":4.3421697272727272E-5},{"$f":"'Identify Toxic Air Contaminants'!$E46*VLOOKUP($B46,'Calculate Dispersion Factors'!$B$7:$N$11,5,FALSE)/J46","v":5.9089320000000004E-3},{"$f":"'Identify Toxic Air Contaminants'!$F46*VLOOKUP($B46,'Calculate Dispersion Factors'!$B$7:$N$11,6,FALSE)/K46","v":5.7958407835151523E-4}]
[null,"Diesel Engine-1","Cadmium and compounds","7440-43-9",5.5999999999999995E-4,1.4E-2,6.7000000000000002E-3,5.0000000000000001E-3,3.6999999999999998E-2,3.6999999999999998E-2,0.03,{"$f":"'Identify Toxic Air Contaminants'!$E47*VLOOKUP($B47,'Calculate Dispersion Factors'!$B$7:$N$11,3,FALSE)/E47","v":7.206582857142858E-3},{"$f":"'Identify Toxic Air Contaminants'!$E47*VLOOKUP($B47,'Calculate Dispersion Factors'!$B$7:$N$11,4,FALSE)/F47","v":1.8831857142857141E-4},{"$f":"'Identify Toxic Air Contaminants'!$E47*VLOOKUP($B47,'Calculate Dispersion Factors'!$B$7:$N$11,5,FALSE)/G47","v":5.3548656716417911E-2},{"$f":"'Identify Toxic Air Contaminants'!$E47*VLOOKUP($B47,'Calculate Dispersion Factors'!$B$7:$N$11,3,FALSE)/H47","v":8.0713727999999995E-4},{"$f":"'Identify Toxic Air Contaminants'!$E47*VLOOKUP($B47,'Calculate Dispersion Factors'!$B$7:$N$11,4,FALSE)/I47","v":7.1255675675675669E-5},{"$f":"'Identify Toxic Air Contaminants'!$E47*VLOOKUP($B47,'Calculate Dispersion Factors'!$B$7:$N$11,5,FALSE)/J47","v":9.6966486486486491E-3},{"$f":"'Identify Toxic Air Contaminants'!$F47*VLOOKUP($B47,'Calculate Dispersion Factors'!$B$7:$N$11,6,FALSE)/K47","v":8.7977344000000013E-2}]
[null,"Diesel Engine-1","Formaldehyde","50-00-0",0.17,4.3,2,9,40,40,49,{"$f":"'Identify Toxic Air Contaminants'!$E48*VLOOKUP($B48,'Calculate Dispersion Factors'!$B$7:$N$11,3,FALSE)/E48","v":2.7317640372705884E-2},{"$f":"'Identify Toxic Air Contaminants'!$E48*VLOOKUP($B48,'Calculate Dispersion Factors'!$B$7:$N$11,4,FALSE)/F48","v":7.0554939627906976E-4},{"$f":"'Identify Toxic Air Contaminants'!$E48*VLOOKUP($B48,'Calculate Dispersion Factors'!$B$7:$N$11,5,FALSE)/G48","v":0.20642775119999998},{"$f":"'Identify Toxic Air Contaminants'!$E48*VLOOKUP($B48,'Calculate Dispersion Factors'!$B$7:$N$11,3,FALSE)/H48","v":5.1599987370666675E-4},{"$f":"'Identify Toxic Air Contaminants'!$E48*VLOOKUP($B48,'Calculate Dispersion Factors'!$B$7:$N$11,4,FALSE)/I48","v":7.5846560099999995E-5},{"$f":"'Identify Toxic Air Contaminants'!$E48*VLOOKUP($B48,'Calculate Dispersion Factors'!$B$7:$N$11,5,FALSE)/J48","v":1.0321387559999999E-2},{"$f":"'Identify Toxic Air Contaminants'!$F48*VLOOKUP($B48,'Calculate Dispersion Factors'!$B$7:$N$11,6,FALSE)/K48","v":6.1982732031999999E-2}]
[null,"Diesel Engine-1","Chromium VI, chromate, and dichromate particulate","18540-29-9",3.1000000000000001E-5,5.1999999999999995E-4,1E-3,8.3000000000000004E-2,0.88,0.88,0.3,{"$f":"'Identify Toxic Air Contaminants'!$E49*VLOOKUP($B49,'Calculate Dispersion Factors'!$B$7:$N$11,3,FALSE)/E49","v":8.67889548387097E-3},{"$f":"'Identify Toxic Air Contaminants'!$E49*VLOOKUP($B49,'Calculate Dispersion Factors'!$B$7:$N$11,4,FALSE)/F49","v":3.3800769230769238E-4},{"$f":"'Identify Toxic Air Contaminants'!$E49*VLOOKUP($B49,'Calculate Dispersion Factors'!$B$7:$N$11,5,FALSE)/G49","v":2.3918400000000003E-2},{"$f":"'Identify Toxic Air Contaminants'!$E49*VLOOKUP($B49,'Calculate Dispersion Factors'!$B$7:$N$11,3,FALSE)/H49","v":3.241515180722892E-6},{"$f":"'Identify Toxic Air Contaminants'!$E49*VLOOKUP($B49,'Calculate Dispersion Factors'!$B$7:$N$11,4,FALSE)/I49","v":1.997318181818182E-7},{"$f":"'Identify Toxic Air Contaminants'!$E49*VLOOKUP($B49,'Calculate Dispersion Factors'!$B$7:$N$11,5,FALSE)/J49","v":2.7180000000000004E-5},{"$f":"'Identify Toxic Air Contaminants'!$F49*VLOOKUP($B49,'Calculate Dispersion Factors'!$B$7:$N$11,6,FALSE)/K49","v":5.8651562666666671E-4}]
[null,"Diesel Engine-1","Arsenic and compounds","7440-38-2",2.4000000000000001E-5,1.2999999999999999E-3,6.2E-4,1.7000000000000001E-4,2.3999999999999998E-3,2.3999999999999998E-3,0.2,{"$f":"'Identify Toxic Air Contaminants'!$E50*VLOOKUP($B50,'Calculate Dispersion Factors'!$B$7:$N$11,3,FALSE)/E50","v":0.17936384000000005},{"$f":"'Identify Toxic Air Contaminants'!$E50*VLOOKUP($B50,'Calculate Dispersion Factors'!$B$7:$N$11,4,FALSE)/F50","v":2.1632492307692309E-3},{"$f":"'Identify Toxic Air Contaminants'!$E50*VLOOKUP($B50,'Calculate Dispersion Factors'!$B$7:$N$11,5,FALSE)/G50","v":0.6172490322580646},{"$f":"'Identify Toxic Air Contaminants'!$E50*VLOOKUP($B50,'Calculate Dispersion Factors'!$B$7:$N$11,3,FALSE)/H50","v":2.5321953882352945E-2},{"$f":"'Identify Toxic Air Contaminants'!$E50*VLOOKUP($B50,'Calculate Dispersion Factors'!$B$7:$N$11,4,FALSE)/I50","v":1.1717600000000002E-3},{"$f":"'Identify Toxic Air Contaminants'!$E50*VLOOKUP($B50,'Calculate Dispersion Factors'!$B$7:$N$11,5,FALSE)/J50","v":0.15945600000000004},{"$f":"'Identify Toxic Air Contaminants'!$F50*VLOOKUP($B50,'Calculate Dispersion Factors'!$B$7:$N$11,6,FALSE)/K50","v":1.407637504E-2}]
[null,"Diesel Engine-1","Lead and compounds","7439-92-1","--","--","--",0.15,0.66,0.66,0.15,"--","--","--",{"$f":"'Identify Toxic Air Contaminants'!$E51*VLOOKUP($B51,'Calculate Dispersion Factors'!$B$7:$N$11,3,FALSE)/H51","v":1.4887198720000001E-4},{"$f":"'Identify Toxic Air Contaminants'!$E51*VLOOKUP($B51,'Calculate Dispersion Factors'!$B$7:$N$11,4,FALSE)/I51","v":2.2103654545454545E-5},{"$f":"'Identify Toxic Air Contaminants'!$E51*VLOOKUP($B51,'Calculate Dispersion Factors'!$B$7:$N$11,5,FALSE)/J51","v":3.0079199999999999E-3},{"$f":"'Identify Toxic Air Contaminants'!$F51*VLOOKUP($B51,'Calculate Dispersion Factors'!$B$7:$N$11,6,FALSE)/K51","v":9.7361594026666679E-2}]
[null,"Diesel Engine-1","Nickel compounds, insoluble","365",3.8E-3,0.1,4.5999999999999999E-2,1.4E-2,6.2E-2,6.2E-2,0.2,{"$f":"'Identify Toxic Air Contaminants'!$E52*VLOOKUP($B52,'Calculate Dispersion Factors'!$B$7:$N$11,3,FALSE)/E52","v":2.7612591157894738E-3},{"$f":"'Identify Toxic Air Contaminants'!$E52*VLOOKUP($B52,'Calculate Dispersion Factors'!$B$7:$N$11,4,FALSE)/F52","v":6.8547959999999992E-5},{"$f":"'Identify Toxic Air Contaminants'!$E52*VLOOKUP($B52,'Calculate Dispersion Factors'!$B$7:$N$11,5,FALSE)/G52","v":2.0278643478260867E-2},{"$f":"'Identify Toxic Air Contaminants'!$E52*VLOOKUP($B52,'Calculate Dispersion Factors'!$B$7:$N$11,3,FALSE)/H52","v":7.4948461714285713E-4},{"$f":"'Identify Toxic Air Contaminants'!$E52*VLOOKUP($B52,'Calculate Dispersion Factors'!$B$7:$N$11,4,FALSE)/I52","v":1.1056122580645159E-4},{"$f":"'Identify Toxic Air Contaminants'!$E52*VLOOKUP($B52,'Calculate Dispersion Factors'!$B$7:$N$11,5,FALSE)/J52","v":1.5045445161290322E-2},{"$f":"'Identify Toxic Air Contaminants'!$F52*VLOOKUP($B52,'Calculate Dispersion Factors'!$B$7:$N$11,6,FALSE)/K52","v":3.4311164159999998E-2}]
[null,"Diesel Engine-1","Naphthalene","91-20-3",2.9000000000000001E-2,0.76,0.35,3.7,16,16,200,{"$f":"'Identify Toxic Air Contaminants'!$E53*VLOOKUP($B53,'Calculate Dispersion Factors'!$B$7:$N$11,3,FALSE)/E53","v":1.8276556799999997E-3},{"$f":"'Identify Toxic Air Contaminants'!$E53*VLOOKUP($B53,'Calculate Dispersion Factors'!$B$7:$N$11,4,FALSE)/F53","v":4.5559878947368415E-5},{"$f":"'Identify Toxic Air Contaminants'!$E53*VLOOKUP($B53,'Calculate Dispersion Factors'!$B$7:$N$11,5,FALSE)/G53","v":1.3462642285714286E-2},{"$f":"'Identify Toxic Air Contaminants'!$E53*VLOOKUP($B53,'Calculate Dispersion Factors'!$B$7:$N$11,3,FALSE)/H53","v":1.4324868843243242E-5},{"$f":"'Identify Toxic Air Contaminants'!$E53*VLOOKUP($B53,'Calculate Dispersion Factors'!$B$7:$N$11,4,FALSE)/I53","v":2.1640942499999999E-6},{"$f":"'Identify Toxic Air Contaminants'!$E53*VLOOKUP($B53,'Calculate Dispersion Factors'!$B$7:$N$11,5,FALSE)/J53","v":2.9449529999999997E-4},{"$f":"'Identify Toxic Air Contaminants'!$F53*VLOOKUP($B53,'Calculate Dispersion Factors'!$B$7:$N$11,6,FALSE)/K53","v":1.7331536767999998E-4}]
[null,"Diesel Engine-1","Polycyclic aromatic hydrocarbons (PAHs)","401",4.3000000000000002E-5,1.6000000000000001E-3,3.0000000000000001E-3,"--","--","--","--",{"$f":"'Identify Toxic Air Contaminants'!$E54*VLOOKUP($B54,'Calculate Dispersion Factors'!$B$7:$N$11,3,FALSE)/E54","v":2.2649898865116285},{"$f":"'Identify Toxic Air Contaminants'!$E54*VLOOKUP($B54,'Calculate Dispersion Factors'!$B$7:$N$11,4,FALSE)/F54","v":3.9766605000000003E-2},{"$f":"'Identify Toxic Air Contaminants'!$E54*VLOOKUP($B54,'Calculate Dispersion Factors'!$B$7:$N$11,5,FALSE)/G54","v":2.8861536000000005},"--","--","--","--"]
[null,"Diesel Engine-1","Benzo[a]pyrene*","50-32-8",4.3000000000000002E-5,1.6000000000000001E-3,3.0000000000000001E-3,2E-3,8.8000000000000005E-3,8.8000000000000005E-3,2E-3,{"$f":"'Identify Toxic Air Contaminants'!$E55*VLOOKUP($B55,'Calculate Dispersion Factors'!$B$7:$N$11,3,FALSE)/E55","v":2.2211917395348838E-3},{"$f":"'Identify Toxic Air Contaminants'!$E55*VLOOKUP($B55,'Calculate Dispersion Factors'!$B$7:$N$11,4,FALSE)/F55","v":3.89976375E-5},{"$f":"'Identify Toxic Air Contaminants'!$E55*VLOOKUP($B55,'Calculate Dispersion Factors'!$B$7:$N$11,5,FALSE)/G55","v":2.8303439999999998E-3},{"$f":"'Identify Toxic Air Contaminants'!$E55*VLOOKUP($B55,'Calculate Dispersion Factors'!$B$7:$N$11,3,FALSE)/H55","v":4.7755622400000007E-5},{"$f":"'Identify Toxic Air Contaminants'!$E55*VLOOKUP($B55,'Calculate Dispersion Factors'!$B$7:$N$11,4,FALSE)/I55","v":7.0904795454545449E-6},{"$f":"'Identify Toxic Air Contaminants'!$E55*VLOOKUP($B55,'Calculate Dispersion Factors'!$B$7:$N$11,5,FALSE)/J55","v":9.6488999999999993E-4},{"$f":"'Identify Toxic Air Contaminants'!$F55*VLOOKUP($B55,'Calculate Dispersion Factors'!$B$7:$N$11,6,FALSE)/K55","v":3.1231957120000001E-2}]
[null,"Diesel Engine-1","Acetaldehyde","75-07-0",0.45,12,5.5,140,620,620,470,{"$f":"'Identify Toxic Air Contaminants'!$E56*VLOOKUP($B56,'Calculate Dispersion Factors'!$B$7:$N$11,3,FALSE)/E56","v":4.6831898624000003E-3},{"$f":"'Identify Toxic Air Contaminants'!$E56*VLOOKUP($B56,'Calculate Dispersion Factors'!$B$7:$N$11,4,FALSE)/F56","v":1.14729951E-4},{"$f":"'Identify Toxic Air Contaminants'!$E56*VLOOKUP($B56,'Calculate Dispersion Factors'!$B$7:$N$11,5,FALSE)/G56","v":3.40641504E-2},{"$f":"'Identify Toxic Air Contaminants'!$E56*VLOOKUP($B56,'Calculate Dispersion Factors'!$B$7:$N$11,3,FALSE)/H56","v":1.5053110272000002E-5},{"$f":"'Identify Toxic Air Contaminants'!$E56*VLOOKUP($B56,'Calculate Dispersion Factors'!$B$7:$N$11,4,FALSE)/I56","v":2.2205796967741936E-6},{"$f":"'Identify Toxic Air Contaminants'!$E56*VLOOKUP($B56,'Calculate Dispersion Factors'!$B$7:$N$11,5,FALSE)/J56","v":3.0218197935483871E-4},{"$f":"'Identify Toxic Air Contaminants'!$F56*VLOOKUP($B56,'Calculate Dispersion Factors'!$B$7:$N$11,6,FALSE)/K56","v":2.9324533427744679E-3}]
[null,"Diesel Engine-1","Acrolein","107-02-8","--","--","--",0.35,1.5,1.5,6.9,"--","--","--",{"$f":"'Identify Toxic Air Contaminants'!$E57*VLOOKUP($B57,'Calculate Dispersion Factors'!$B$7:$N$11,3,FALSE)/H57","v":2.6059003611428571E-4},{"$f":"'Identify Toxic Air Contaminants'!$E57*VLOOKUP($B57,'Calculate Dispersion Factors'!$B$7:$N$11,4,FALSE)/I57","v":3.9722663999999993E-5},{"$f":"'Identify Toxic Air Contaminants'!$E57*VLOOKUP($B57,'Calculate Dispersion Factors'!$B$7:$N$11,5,FALSE)/J57","v":5.4055583999999997E-3},{"$f":"'Identify Toxic Air Contaminants'!$F57*VLOOKUP($B57,'Calculate Dispersion Factors'!$B$7:$N$11,6,FALSE)/K57","v":8.6447303234782596E-3}]
[null,"Diesel Engine-1","Ammonia**","7664-41-7","--","--","--",500,2200,2200,1200,"--","--","--",{"$f":"'Identify Toxic Air Contaminants'!$E58*VLOOKUP($B58,'Calculate Dispersion Factors'!$B$7:$N$11,3,FALSE)/H58","v":4.3047321600000002E-6},{"$f":"'Identify Toxic Air Contaminants'!$E58*VLOOKUP($B58,'Calculate Dispersion Factors'!$B$7:$N$11,4,FALSE)/I58","v":6.3914181818181818E-7},{"$f":"'Identify Toxic Air Contaminants'!$E58*VLOOKUP($B58,'Calculate Dispersion Factors'!$B$7:$N$11,5,FALSE)/J58","v":8.6976000000000002E-5},{"$f":"'Identify Toxic Air Contaminants'!$F58*VLOOKUP($B58,'Calculate Dispersion Factors'!$B$7:$N$11,6,FALSE)/K58","v":1.1730312533333334E-3}]
[null,"Diesel Engine-1","Copper and compounds","7440-50-8","--","--","--","--","--","--",100,"--","--","--","--","--","--",{"$f":"'Identify Toxic Air Contaminants'!$F59*VLOOKUP($B59,'Calculate Dispersion Factors'!$B$7:$N$11,6,FALSE)/K59","v":7.2141422080000019E-5}]
[null,"Diesel Engine-1","Ethyl benzene","100-41-4",0.4,10,4.8,260,1100,1100,22000,{"$f":"'Identify Toxic Air Contaminants'!$E60*VLOOKUP($B60,'Calculate Dispersion Factors'!$B$7:$N$11,3,FALSE)/E60","v":7.3314969600000017E-5},{"$f":"'Identify Toxic Air Contaminants'!$E60*VLOOKUP($B60,'Calculate Dispersion Factors'!$B$7:$N$11,4,FALSE)/F60","v":1.9158276000000001E-6},{"$f":"'Identify Toxic Air Contaminants'!$E60*VLOOKUP($B60,'Calculate Dispersion Factors'!$B$7:$N$11,5,FALSE)/G60","v":5.4314700000000012E-4},{"$f":"'Identify Toxic Air Contaminants'!$E60*VLOOKUP($B60,'Calculate Dispersion Factors'!$B$7:$N$11,3,FALSE)/H60","v":1.1279226092307694E-7},{"$f":"'Identify Toxic Air Contaminants'!$E60*VLOOKUP($B60,'Calculate Dispersion Factors'!$B$7:$N$11,4,FALSE)/I60","v":1.7416614545454545E-8},{"$f":"'Identify Toxic Air Contaminants'!$E60*VLOOKUP($B60,'Calculate Dispersion Factors'!$B$7:$N$11,5,FALSE)/J60","v":2.3700960000000003E-6},{"$f":"'Identify Toxic Air Contaminants'!$F60*VLOOKUP($B60,'Calculate Dispersion Factors'!$B$7:$N$11,6,FALSE)/K60","v":8.717754996363637E-7}]
[null,"Diesel Engine-1","Hexane","110-54-3","--","--","--",700,3100,3100,"--","--","--","--",{"$f":"'Identify Toxic Air Contaminants'!$E61*VLOOKUP($B61,'Calculate Dispersion Factors'!$B$7:$N$11,3,FALSE)/H61","v":1.0339044205714286E-7},{"$f":"'Identify Toxic Air Contaminants'!$E61*VLOOKUP($B61,'Calculate Dispersion Factors'!$B$7:$N$11,4,FALSE)/I61","v":1.525177935483871E-8},{"$f":"'Identify Toxic Air Contaminants'!$E61*VLOOKUP($B61,'Calculate Dispersion Factors'!$B$7:$N$11,5,FALSE)/J61","v":2.0754998709677415E-6},"--"]
[null,"Diesel Engine-1","Hydrochloric acid","7647-01-0","--","--","--",20,88,88,2100,"--","--","--",{"$f":"'Identify Toxic Air Contaminants'!$E62*VLOOKUP($B62,'Calculate Dispersion Factors'!$B$7:$N$11,3,FALSE)/H62","v":2.5061612544000002E-5},{"$f":"'Identify Toxic Air Contaminants'!$E62*VLOOKUP($B62,'Calculate Dispersion Factors'!$B$7:$N$11,4,FALSE)/I62","v":3.7210037727272728E-6},{"$f":"'Identify Toxic Air Contaminants'!$E62*VLOOKUP($B62,'Calculate Dispersion Factors'!$B$7:$N$11,5,FALSE)/J62","v":5.0636340000000005E-4},{"$f":"'Identify Toxic Air Contaminants'!$F62*VLOOKUP($B62,'Calculate Dispersion Factors'!$B$7:$N$11,6,FALSE)/K62","v":1.5609694464E-4}]
[null,"Diesel Engine-1","Manganese and compounds","7439-96-5","--","--","--",0.09,0.4,0.4,0.3,"--","--","--",{"$f":"'Identify Toxic Air Contaminants'!$E63*VLOOKUP($B63,'Calculate Dispersion Factors'!$B$7:$N$11,3,FALSE)/H63","v":9.2671317333333338E-5},{"$f":"'Identify Toxic Air Contaminants'!$E63*VLOOKUP($B63,'Calculate Dispersion Factors'!$B$7:$N$11,4,FALSE)/I63","v":1.3621709999999998E-5},{"$f":"'Identify Toxic Air Contaminants'!$E63*VLOOKUP($B63,'Calculate Dispersion Factors'!$B$7:$N$11,5,FALSE)/J63","v":1.8536759999999998E-3},{"$f":"'Identify Toxic Air Contaminants'!$F63*VLOOKUP($B63,'Calculate Dispersion Factors'!$B$7:$N$11,6,FALSE)/K63","v":1.8181984426666669E-2}]
[null,"Diesel Engine-1","Mercury and compounds","7439-97-6","--","--","--",7.6999999999999999E-2,0.63,0.63,0.6,"--","--","--",{"$f":"'Identify Toxic Air Contaminants'!$E64*VLOOKUP($B64,'Calculate Dispersion Factors'!$B$7:$N$11,3,FALSE)/H64","v":6.9882015584415587E-5},{"$f":"'Identify Toxic Air Contaminants'!$E64*VLOOKUP($B64,'Calculate Dispersion Factors'!$B$7:$N$11,4,FALSE)/I64","v":5.5798095238095232E-6},{"$f":"'Identify Toxic Air Contaminants'!$E64*VLOOKUP($B64,'Calculate Dispersion Factors'!$B$7:$N$11,5,FALSE)/J64","v":7.5931428571428575E-4},{"$f":"'Identify Toxic Air Contaminants'!$F64*VLOOKUP($B64,'Calculate Dispersion Factors'!$B$7:$N$11,6,FALSE)/K64","v":5.8651562666666669E-3}]
[null,"Diesel Engine-1","Selenium and compounds","7782-49-2","--","--","--","--","--","--",2,"--","--","--","--","--","--",{"$f":"'Identify Toxic Air Contaminants'!$F65*VLOOKUP($B65,'Calculate Dispersion Factors'!$B$7:$N$11,6,FALSE)/K65","v":1.9355015680000002E-3}]
[null,"Diesel Engine-1","Toluene","108-88-3","--","--","--",5000,22000,22000,7500,"--","--","--",{"$f":"'Identify Toxic Air Contaminants'!$E66*VLOOKUP($B66,'Calculate Dispersion Factors'!$B$7:$N$11,3,FALSE)/H66","v":5.671484620800001E-8},{"$f":"'Identify Toxic Air Contaminants'!$E66*VLOOKUP($B66,'Calculate Dispersion Factors'!$B$7:$N$11,4,FALSE)/I66","v":8.4206934545454556E-9},{"$f":"'Identify Toxic Air Contaminants'!$E66*VLOOKUP($B66,'Calculate Dispersion Factors'!$B$7:$N$11,5,FALSE)/J66","v":1.1459088000000001E-6},{"$f":"'Identify Toxic Air Contaminants'!$F66*VLOOKUP($B66,'Calculate Dispersion Factors'!$B$7:$N$11,6,FALSE)/K66","v":2.4727498820266667E-5}]
[null,"Diesel Engine-1","Xylene (mixture), including m-xylene, o-xylene, p-xylene","1330-20-7","--","--","--",220,970,970,8700,"--","--","--",{"$f":"'Identify Toxic Air Contaminants'!$E67*VLOOKUP($B67,'Calculate Dispersion Factors'!$B$7:$N$11,3,FALSE)/H67","v":5.185245556363637E-7},{"$f":"'Identify Toxic Air Contaminants'!$E67*VLOOKUP($B67,'Calculate Dispersion Factors'!$B$7:$N$11,4,FALSE)/I67","v":7.6828799999999995E-8},{"$f":"'Identify Toxic Air Contaminants'!$E67*VLOOKUP($B67,'Calculate Dispersion Factors'!$B$7:$N$11,5,FALSE)/J67","v":1.0455053195876287E-5},{"$f":"'Identify Toxic Air Contaminants'!$F67*VLOOKUP($B67,'Calculate Dispersion Factors'!$B$7:$N$11,6,FALSE)/K67","v":8.5752629554023003E-6}]
[null,"Diesel Engine-1","Diesel Particulate Matter","200",0.1,2.6,1.2,5,22,22,"--",{"$f":"'Identify Toxic Air Contaminants'!$E68*VLOOKUP($B68,'Calculate Dispersion Factors'!$B$7:$N$11,3,FALSE)/E68","v":0.19909386239999999},{"$f":"'Identify Toxic Air Contaminants'!$E68*VLOOKUP($B68,'Calculate Dispersion Factors'!$B$7:$N$11,4,FALSE)/F68","v":5.0025138461538459E-3},{"$f":"'Identify Toxic Air Contaminants'!$E68*VLOOKUP($B68,'Calculate Dispersion Factors'!$B$7:$N$11,5,FALSE)/G68","v":1.4749679999999998},{"$f":"'Identify Toxic Air Contaminants'!$E68*VLOOKUP($B68,'Calculate Dispersion Factors'!$B$7:$N$11,3,FALSE)/H68","v":3.9818772479999999E-3},{"$f":"'Identify Toxic Air Contaminants'!$E68*VLOOKUP($B68,'Calculate Dispersion Factors'!$B$7:$N$11,4,FALSE)/I68","v":5.9120618181818176E-4},{"$f":"'Identify Toxic Air Contaminants'!$E68*VLOOKUP($B68,'Calculate Dispersion Factors'!$B$7:$N$11,5,FALSE)/J68","v":8.0452799999999991E-2},"--"]
[null,"ASR-1 MH","Aluminum and compounds","7429-90-5","--","--","--",5,22,22,"--","--","--","--",{"$f":"'Identify Toxic Air Contaminants'!$E69*VLOOKUP($B69,'Calculate Dispersion Factors'!$B$7:$N$11,3,FALSE)/H69","v":4.2680472532568343E-5},{"$f":"'Identify Toxic Air Contaminants'!$E69*VLOOKUP($B69,'Calculate Dispersion Factors'!$B$7:$N$11,4,FALSE)/I69","v":6.3456649690492579E-6},{"$f":"'Identify Toxic Air Contaminants'!$E69*VLOOKUP($B69,'Calculate Dispersion Factors'!$B$7:$N$11,5,FALSE)/J69","v":9.6146438924988762E-4},"--"]
[null,"ASR-1 MH","Arsenic and compounds","7440-38-2",2.4000000000000001E-5,1.2999999999999999E-3,6.2E-4,1.7000000000000001E-4,2.3999999999999998E-3,2.3999999999999998E-3,0.2,{"$f":"'Identify Toxic Air Contaminants'!$E70*VLOOKUP($B70,'Calculate Dispersion Factors'!$B$7:$N$11,3,FALSE)/E70","v":1.8077286121375831E-2},{"$f":"'Identify Toxic Air Contaminants'!$E70*VLOOKUP($B70,'Calculate Dispersion Factors'!$B$7:$N$11,4,FALSE)/F70","v":2.1832411974443734E-4},{"$f":"'Identify Toxic Air Contaminants'!$E70*VLOOKUP($B70,'Calculate Dispersion Factors'!$B$7:$N$11,5,FALSE)/G70","v":6.9360057592318808E-2},{"$f":"'Identify Toxic Air Contaminants'!$E70*VLOOKUP($B70,'Calculate Dispersion Factors'!$B$7:$N$11,3,FALSE)/H70","v":2.5520874524295289E-3},{"$f":"'Identify Toxic Air Contaminants'!$E70*VLOOKUP($B70,'Calculate Dispersion Factors'!$B$7:$N$11,4,FALSE)/I70","v":1.1825889819490356E-4},{"$f":"'Identify Toxic Air Contaminants'!$E70*VLOOKUP($B70,'Calculate Dispersion Factors'!$B$7:$N$11,5,FALSE)/J70","v":1.7918014878015691E-2},{"$f":"'Identify Toxic Air Contaminants'!$F70*VLOOKUP($B70,'Calculate Dispersion Factors'!$B$7:$N$11,6,FALSE)/K70","v":6.7081756800778933E-4}]
[null,"ASR-1 MH","Barium and compounds","NoRBC","--","--","--","--","--","--","--"]
[null,"ASR-1 MH","Cadmium and compounds","7440-43-9",5.5999999999999995E-4,1.4E-2,6.7000000000000002E-3,5.0000000000000001E-3,3.6999999999999998E-2,3.6999999999999998E-2,0.03,{"$f":"'Identify Toxic Air Contaminants'!$E72*VLOOKUP($B72,'Calculate Dispersion Factors'!$B$7:$N$11,3,FALSE)/E72","v":1.2299010736150347E-3},{"$f":"'Identify Toxic Air Contaminants'!$E72*VLOOKUP($B72,'Calculate Dispersion Factors'!$B$7:$N$11,4,FALSE)/F72","v":3.2183314437327331E-5},{"$f":"'Identify Toxic Air Contaminants'!$E72*VLOOKUP($B72,'Calculate Dispersion Factors'!$B$7:$N$11,5,FALSE)/G72","v":1.018919950525967E-2},{"$f":"'Identify Toxic Air Contaminants'!$E72*VLOOKUP($B72,'Calculate Dispersion Factors'!$B$7:$N$11,3,FALSE)/H72","v":1.3774892024488386E-4},{"$f":"'Identify Toxic Air Contaminants'!$E72*VLOOKUP($B72,'Calculate Dispersion Factors'!$B$7:$N$11,4,FALSE)/I72","v":1.217747032763737E-5},{"$f":"'Identify Toxic Air Contaminants'!$E72*VLOOKUP($B72,'Calculate Dispersion Factors'!$B$7:$N$11,5,FALSE)/J72","v":1.8450712617632378E-3},{"$f":"'Identify Toxic Air Contaminants'!$F72*VLOOKUP($B72,'Calculate Dispersion Factors'!$B$7:$N$11,6,FALSE)/K72","v":7.0994859280824373E-3}]
[null,"ASR-1 MH","Cobalt and compounds","7440-48-4","--","--","--",0.1,0.44,0.44,"--","--","--","--",{"$f":"'Identify Toxic Air Contaminants'!$E73*VLOOKUP($B73,'Calculate Dispersion Factors'!$B$7:$N$11,3,FALSE)/H73","v":5.9383884908719604E-6},{"$f":"'Identify Toxic Air Contaminants'!$E73*VLOOKUP($B73,'Calculate Dispersion Factors'!$B$7:$N$11,4,FALSE)/I73","v":8.8291018311422307E-7},{"$f":"'Identify Toxic Air Contaminants'!$E73*VLOOKUP($B73,'Calculate Dispersion Factors'!$B$7:$N$11,5,FALSE)/J73","v":1.3377427016882169E-4},"--"]
[null,"ASR-1 MH","Copper and compounds","7440-50-8","--","--","--","--","--","--",100,"--","--","--","--","--","--",{"$f":"'Identify Toxic Air Contaminants'!$F74*VLOOKUP($B74,'Calculate Dispersion Factors'!$B$7:$N$11,6,FALSE)/K74","v":2.9650136505944284E-3}]
[null,"ASR-1 MH","Lead and compounds","7439-92-1","--","--","--",0.15,0.66,0.66,0.15,"--","--","--",{"$f":"'Identify Toxic Air Contaminants'!$E75*VLOOKUP($B75,'Calculate Dispersion Factors'!$B$7:$N$11,3,FALSE)/H75","v":2.0969651900795967E-3},{"$f":"'Identify Toxic Air Contaminants'!$E75*VLOOKUP($B75,'Calculate Dispersion Factors'!$B$7:$N$11,4,FALSE)/I75","v":3.1177345887747302E-4},{"$f":"'Identify Toxic Air Contaminants'!$E75*VLOOKUP($B75,'Calculate Dispersion Factors'!$B$7:$N$11,5,FALSE)/J75","v":4.723840286022319E-2},{"$f":"'Identify Toxic Air Contaminants'!$F75*VLOOKUP($B75,'Calculate Dispersion Factors'!$B$7:$N$11,6,FALSE)/K75","v":0.64845698240752969}]
[null,"ASR-1 MH","Manganese and compounds","7439-96-5","--","--","--",0.09,0.4,0.4,0.3,"--","--","--",{"$f":"'Identify Toxic Air Contaminants'!$E76*VLOOKUP($B76,'Calculate Dispersion Factors'!$B$7:$N$11,3,FALSE)/H76","v":1.6480459180654301E-4},{"$f":"'Identify Toxic Air Contaminants'!$E76*VLOOKUP($B76,'Calculate Dispersion Factors'!$B$7:$N$11,4,FALSE)/I76","v":2.4257856492229589E-5},{"$f":"'Identify Toxic Air Contaminants'!$E76*VLOOKUP($B76,'Calculate Dispersion Factors'!$B$7:$N$11,5,FALSE)/J76","v":3.6754328018529683E-3},{"$f":"'Identify Toxic Air Contaminants'!$F76*VLOOKUP($B76,'Calculate Dispersion Factors'!$B$7:$N$11,6,FALSE)/K76","v":1.528905040417753E-2}]
[null,"ASR-1 MH","Mercury and compounds","7439-97-6","--","--","--",7.6999999999999999E-2,0.63,0.63,0.6,"--","--","--",{"$f":"'Identify Toxic Air Contaminants'!$E77*VLOOKUP($B77,'Calculate Dispersion Factors'!$B$7:$N$11,3,FALSE)/H77","v":2.2890070088755118E-7},{"$f":"'Identify Toxic Air Contaminants'!$E77*VLOOKUP($B77,'Calculate Dispersion Factors'!$B$7:$N$11,4,FALSE)/I77","v":1.8301972339687458E-8},{"$f":"'Identify Toxic Air Contaminants'!$E77*VLOOKUP($B77,'Calculate Dispersion Factors'!$B$7:$N$11,5,FALSE)/J77","v":2.7730261120738573E-6},{"$f":"'Identify Toxic Air Contaminants'!$F77*VLOOKUP($B77,'Calculate Dispersion Factors'!$B$7:$N$11,6,FALSE)/K77","v":9.0839879001054814E-6}]
[null,"ASR-1 MH","Nickel compounds, insoluble","365",3.8E-3,0.1,4.5999999999999999E-2,1.4E-2,6.2E-2,6.2E-2,0.2,{"$f":"'Identify Toxic Air Contaminants'!$E78*VLOOKUP($B78,'Calculate Dispersion Factors'!$B$7:$N$11,3,FALSE)/E78","v":2.7829506265802267E-3},{"$f":"'Identify Toxic Air Contaminants'!$E78*VLOOKUP($B78,'Calculate Dispersion Factors'!$B$7:$N$11,4,FALSE)/F78","v":6.9181455444018586E-5},{"$f":"'Identify Toxic Air Contaminants'!$E78*VLOOKUP($B78,'Calculate Dispersion Factors'!$B$7:$N$11,5,FALSE)/G78","v":2.2787040660085175E-2},{"$f":"'Identify Toxic Air Contaminants'!$E78*VLOOKUP($B78,'Calculate Dispersion Factors'!$B$7:$N$11,3,FALSE)/H78","v":7.553723129289187E-4},{"$f":"'Identify Toxic Air Contaminants'!$E78*VLOOKUP($B78,'Calculate Dispersion Factors'!$B$7:$N$11,4,FALSE)/I78","v":1.1158299265164288E-4},{"$f":"'Identify Toxic Air Contaminants'!$E78*VLOOKUP($B78,'Calculate Dispersion Factors'!$B$7:$N$11,5,FALSE)/J78","v":1.690651403812771E-2},{"$f":"'Identify Toxic Air Contaminants'!$F78*VLOOKUP($B78,'Calculate Dispersion Factors'!$B$7:$N$11,6,FALSE)/K78","v":1.6351178220189867E-2}]
[null,"ASR-1 MH","Zinc and compounds","NoRBC","--","--","--","--","--","--","--"]
[null,"ASR-1 MH","Benzene","71-43-2",0.13,3.3,1.5,3,13,13,29,{"$f":"'Identify Toxic Air Contaminants'!$E80*VLOOKUP($B80,'Calculate Dispersion Factors'!$B$7:$N$11,3,FALSE)/E80","v":2.3730230769230766E-5},{"$f":"'Identify Toxic Air Contaminants'!$E80*VLOOKUP($B80,'Calculate Dispersion Factors'!$B$7:$N$11,4,FALSE)/F80","v":6.1154999999999989E-7},{"$f":"'Identify Toxic Air Contaminants'!$E80*VLOOKUP($B80,'Calculate Dispersion Factors'!$B$7:$N$11,5,FALSE)/G80","v":2.0384999999999997E-4},{"$f":"'Identify Toxic Air Contaminants'!$E80*VLOOKUP($B80,'Calculate Dispersion Factors'!$B$7:$N$11,3,FALSE)/H80","v":1.02831E-6},{"$f":"'Identify Toxic Air Contaminants'!$E80*VLOOKUP($B80,'Calculate Dispersion Factors'!$B$7:$N$11,4,FALSE)/I80","v":1.5523961538461536E-7},{"$f":"'Identify Toxic Air Contaminants'!$E80*VLOOKUP($B80,'Calculate Dispersion Factors'!$B$7:$N$11,5,FALSE)/J80","v":2.3521153846153841E-5},{"$f":"'Identify Toxic Air Contaminants'!$F80*VLOOKUP($B80,'Calculate Dispersion Factors'!$B$7:$N$11,6,FALSE)/K80","v":3.2895558620689646E-5}]
[null,"ASR-1 MH","Polychlorinated biphenyls (PCBs)","1336-36-3",5.2999999999999998E-4,0.02,9.1999999999999998E-3,"--","--","--","--",{"$f":"'Identify Toxic Air Contaminants'!$E81*VLOOKUP($B81,'Calculate Dispersion Factors'!$B$7:$N$11,3,FALSE)/E81","v":8.1859408851513204E-4},{"$f":"'Identify Toxic Air Contaminants'!$E81*VLOOKUP($B81,'Calculate Dispersion Factors'!$B$7:$N$11,4,FALSE)/F81","v":1.4191067783388427E-5},{"$f":"'Identify Toxic Air Contaminants'!$E81*VLOOKUP($B81,'Calculate Dispersion Factors'!$B$7:$N$11,5,FALSE)/G81","v":4.6742647507867019E-3},"--","--","--","--"]
[null,"ASR-1 MH","Polychlorinated biphenyls (PCBs) TEQ","645",1.0000000000000001E-9,8.9999999999999999E-8,4.1999999999999999E-8,1.3E-7,2.5999999999999998E-5,2.5999999999999998E-5,"--",{"$f":"'Identify Toxic Air Contaminants'!$E82*VLOOKUP($B82,'Calculate Dispersion Factors'!$B$7:$N$11,3,FALSE)/E82","v":5.4231858364127512E-3},{"$f":"'Identify Toxic Air Contaminants'!$E82*VLOOKUP($B82,'Calculate Dispersion Factors'!$B$7:$N$11,4,FALSE)/F82","v":3.9419632731634532E-5},{"$f":"'Identify Toxic Air Contaminants'!$E82*VLOOKUP($B82,'Calculate Dispersion Factors'!$B$7:$N$11,5,FALSE)/G82","v":1.2798582055725498E-2},{"$f":"'Identify Toxic Air Contaminants'!$E82*VLOOKUP($B82,'Calculate Dispersion Factors'!$B$7:$N$11,3,FALSE)/H82","v":4.1716814126251933E-5},{"$f":"'Identify Toxic Air Contaminants'!$E82*VLOOKUP($B82,'Calculate Dispersion Factors'!$B$7:$N$11,4,FALSE)/I82","v":1.3645257484027339E-7},{"$f":"'Identify Toxic Air Contaminants'!$E82*VLOOKUP($B82,'Calculate Dispersion Factors'!$B$7:$N$11,5,FALSE)/J82","v":2.0674632551556574E-5},"--"]
[null,"ASR-1 MH","Polychlorinated dibenzo-p-dioxins (PCDDs) & dibenzofurans (PCDFs) TEQ","646",1.0000000000000001E-9,8.9999999999999999E-8,4.1999999999999999E-8,1.3E-7,2.5999999999999998E-5,2.5999999999999998E-5,"--",{"$f":"'Identify Toxic Air Contaminants'!$E83*VLOOKUP($B83,'Calculate Dispersion Factors'!$B$7:$N$11,3,FALSE)/E83","v":5.9655044200540245E-3},{"$f":"'Identify Toxic Air Contaminants'!$E83*VLOOKUP($B83,'Calculate Dispersion Factors'!$B$7:$N$11,4,FALSE)/F83","v":4.3361596004797971E-5},{"$f":"'Identify Toxic Air Contaminants'!$E83*VLOOKUP($B83,'Calculate Dispersion Factors'!$B$7:$N$11,5,FALSE)/G83","v":1.4078440261298043E-2},{"$f":"'Identify Toxic Air Contaminants'!$E83*VLOOKUP($B83,'Calculate Dispersion Factors'!$B$7:$N$11,3,FALSE)/H83","v":4.5888495538877115E-5},{"$f":"'Identify Toxic Air Contaminants'!$E83*VLOOKUP($B83,'Calculate Dispersion Factors'!$B$7:$N$11,4,FALSE)/I83","v":1.5009783232430067E-7},{"$f":"'Identify Toxic Air Contaminants'!$E83*VLOOKUP($B83,'Calculate Dispersion Factors'!$B$7:$N$11,5,FALSE)/J83","v":2.2742095806712224E-5},"--"]
[null,"ASR-1 MH","Polychlorinated naphthalenes","NoRBC","--","--","--","--","--","--","--"]
[null,"ASR-1 MH","Hexachlorobenzene","118-74-1",2E-3,5.0999999999999997E-2,2.4E-2,"--","--","--","--",{"$f":"'Identify Toxic Air Contaminants'!$E85*VLOOKUP($B85,'Calculate Dispersion Factors'!$B$7:$N$11,3,FALSE)/E85","v":1.4913761050135063E-5},{"$f":"'Identify Toxic Air Contaminants'!$E85*VLOOKUP($B85,'Calculate Dispersion Factors'!$B$7:$N$11,4,FALSE)/F85","v":3.8260231768939396E-7},{"$f":"'Identify Toxic Air Contaminants'!$E85*VLOOKUP($B85,'Calculate Dispersion Factors'!$B$7:$N$11,5,FALSE)/G85","v":1.2318635228635789E-4},"--","--","--","--"]
[null,"ASR-1 MH","2,4,6-Trichlorophenol","88-06-2",0.05,1.3,0.6,"--","--","--","--",{"$f":"'Identify Toxic Air Contaminants'!$E86*VLOOKUP($B86,'Calculate Dispersion Factors'!$B$7:$N$11,3,FALSE)/E86","v":1.2339719999999998E-2},{"$f":"'Identify Toxic Air Contaminants'!$E86*VLOOKUP($B86,'Calculate Dispersion Factors'!$B$7:$N$11,4,FALSE)/F86","v":3.1047923076923072E-4},{"$f":"'Identify Toxic Air Contaminants'!$E86*VLOOKUP($B86,'Calculate Dispersion Factors'!$B$7:$N$11,5,FALSE)/G86","v":0.10192499999999999},"--","--","--","--"]
[null,"ASR-1 MH","PBDDs/PBDFs","NoRBC","--","--","--","--","--","--","--"]
[null,"ASR-1 MH","Polybrominated diphenyl ethers (PBDEs)","447","--","--","--","--","--","--",6,"--","--","--","--","--","--",{"$f":"'Identify Toxic Air Contaminants'!$F88*VLOOKUP($B88,'Calculate Dispersion Factors'!$B$7:$N$11,6,FALSE)/K88","v":2.4456890500283989E-4}]
[null,"ASR-1 MH","Tetrabromobisphenol A","NoRBC","--","--","--","--","--","--","--"]
[null,"ASR-1 MH","Hexabromocyclododecane","NoRBC","--","--","--","--","--","--","--"]
[null,"ASR-1 MH","2,4,6-Tribromophenol","NoRBC","--","--","--","--","--","--","--"]
[null,"ASR-1 MH","Polycyclic aromatic hydrocarbons (PAHs)","401",4.3000000000000002E-5,1.6000000000000001E-3,3.0000000000000001E-3,"--","--","--","--",{"$f":"'Identify Toxic Air Contaminants'!$E92*VLOOKUP($B92,'Calculate Dispersion Factors'!$B$7:$N$11,3,FALSE)/E92","v":1.8886559976809516E-2},{"$f":"'Identify Toxic Air Contaminants'!$E92*VLOOKUP($B92,'Calculate Dispersion Factors'!$B$7:$N$11,4,FALSE)/F92","v":3.3204881258787756E-4},{"$f":"'Identify Toxic Air Contaminants'!$E92*VLOOKUP($B92,'Calculate Dispersion Factors'!$B$7:$N$11,5,FALSE)/G92","v":2.683222727982849E-2},"--","--","--","--"]
[null,"ASR-1 MH","Bis(2-ethylhexyl) phthalate (DEHP)","117-81-7",0.08,11,5,"--","--","--","--",{"$f":"'Identify Toxic Air Contaminants'!$E93*VLOOKUP($B93,'Calculate Dispersion Factors'!$B$7:$N$11,3,FALSE)/E93","v":2.8132776526391144E-6},{"$f":"'Identify Toxic Air Contaminants'!$E93*VLOOKUP($B93,'Calculate Dispersion Factors'!$B$7:$N$11,4,FALSE)/F93","v":1.3384757113877722E-8},{"$f":"'Identify Toxic Air Contaminants'!$E93*VLOOKUP($B93,'Calculate Dispersion Factors'!$B$7:$N$11,5,FALSE)/G93","v":4.4615857046259078E-6},"--","--","--","--"]
[null,"ASR-1 Piles","Aluminum and compounds","7429-90-5","--","--","--",5,22,22,"--","--","--","--",{"$f":"'Identify Toxic Air Contaminants'!$E94*VLOOKUP($B94,'Calculate Dispersion Factors'!$B$7:$N$11,3,FALSE)/H94","v":6.558826711383375E-7},{"$f":"'Identify Toxic Air Contaminants'!$E94*VLOOKUP($B94,'Calculate Dispersion Factors'!$B$7:$N$11,4,FALSE)/I94","v":9.7515595378497319E-8},{"$f":"'Identify Toxic Air Contaminants'!$E94*VLOOKUP($B94,'Calculate Dispersion Factors'!$B$7:$N$11,5,FALSE)/J94","v":1.477509020886323E-5},"--"]
[null,"ASR-1 Piles","Arsenic and compounds","7440-38-2",2.4000000000000001E-5,1.2999999999999999E-3,6.2E-4,1.7000000000000001E-4,2.3999999999999998E-3,2.3999999999999998E-3,0.2,{"$f":"'Identify Toxic Air Contaminants'!$E95*VLOOKUP($B95,'Calculate Dispersion Factors'!$B$7:$N$11,3,FALSE)/E95","v":2.7779867477269692E-4},{"$f":"'Identify Toxic Air Contaminants'!$E95*VLOOKUP($B95,'Calculate Dispersion Factors'!$B$7:$N$11,4,FALSE)/F95","v":3.355047363232436E-6},{"$f":"'Identify Toxic Air Contaminants'!$E95*VLOOKUP($B95,'Calculate Dispersion Factors'!$B$7:$N$11,5,FALSE)/G95","v":1.0658752620239897E-3},{"$f":"'Identify Toxic Air Contaminants'!$E95*VLOOKUP($B95,'Calculate Dispersion Factors'!$B$7:$N$11,3,FALSE)/H95","v":3.9218636438498382E-5},{"$f":"'Identify Toxic Air Contaminants'!$E95*VLOOKUP($B95,'Calculate Dispersion Factors'!$B$7:$N$11,4,FALSE)/I95","v":1.817317321750903E-6},{"$f":"'Identify Toxic Air Contaminants'!$E95*VLOOKUP($B95,'Calculate Dispersion Factors'!$B$7:$N$11,5,FALSE)/J95","v":2.753511093561974E-4},{"$f":"'Identify Toxic Air Contaminants'!$F95*VLOOKUP($B95,'Calculate Dispersion Factors'!$B$7:$N$11,6,FALSE)/K95","v":9.656148492491307E-6}]
[null,"ASR-1 Piles","Barium and compounds","NoRBC","--","--","--","--","--","--","--"]
[null,"ASR-1 Piles","Cadmium and compounds","7440-43-9",5.5999999999999995E-4,1.4E-2,6.7000000000000002E-3,5.0000000000000001E-3,3.6999999999999998E-2,3.6999999999999998E-2,0.03,{"$f":"'Identify Toxic Air Contaminants'!$E97*VLOOKUP($B97,'Calculate Dispersion Factors'!$B$7:$N$11,3,FALSE)/E97","v":1.8900231265785275E-5},{"$f":"'Identify Toxic Air Contaminants'!$E97*VLOOKUP($B97,'Calculate Dispersion Factors'!$B$7:$N$11,4,FALSE)/F97","v":4.9456992827649566E-7},{"$f":"'Identify Toxic Air Contaminants'!$E97*VLOOKUP($B97,'Calculate Dispersion Factors'!$B$7:$N$11,5,FALSE)/G97","v":1.5658025770852417E-4},{"$f":"'Identify Toxic Air Contaminants'!$E97*VLOOKUP($B97,'Calculate Dispersion Factors'!$B$7:$N$11,3,FALSE)/H97","v":2.1168259017679506E-6},{"$f":"'Identify Toxic Air Contaminants'!$E97*VLOOKUP($B97,'Calculate Dispersion Factors'!$B$7:$N$11,4,FALSE)/I97","v":1.8713456745597134E-7},{"$f":"'Identify Toxic Air Contaminants'!$E97*VLOOKUP($B97,'Calculate Dispersion Factors'!$B$7:$N$11,5,FALSE)/J97","v":2.835372234181384E-5},{"$f":"'Identify Toxic Air Contaminants'!$F97*VLOOKUP($B97,'Calculate Dispersion Factors'!$B$7:$N$11,6,FALSE)/K97","v":1.0219423821219967E-4}]
[null,"ASR-1 Piles","Cobalt and compounds","7440-48-4","--","--","--",0.1,0.44,0.44,"--","--","--","--",{"$f":"'Identify Toxic Air Contaminants'!$E98*VLOOKUP($B98,'Calculate Dispersion Factors'!$B$7:$N$11,3,FALSE)/H98","v":9.1256864662830946E-8},{"$f":"'Identify Toxic Air Contaminants'!$E98*VLOOKUP($B98,'Calculate Dispersion Factors'!$B$7:$N$11,4,FALSE)/I98","v":1.3567925913526627E-8},{"$f":"'Identify Toxic Air Contaminants'!$E98*VLOOKUP($B98,'Calculate Dispersion Factors'!$B$7:$N$11,5,FALSE)/J98","v":2.0557463505343375E-6},"--"]
[null,"ASR-1 Piles","Copper and compounds","7440-50-8","--","--","--","--","--","--",100,"--","--","--","--","--","--",{"$f":"'Identify Toxic Air Contaminants'!$F99*VLOOKUP($B99,'Calculate Dispersion Factors'!$B$7:$N$11,6,FALSE)/K99","v":4.2680176336811578E-5}]
[null,"ASR-1 Piles","Lead and compounds","7439-92-1","--","--","--",0.15,0.66,0.66,0.15,"--","--","--",{"$f":"'Identify Toxic Air Contaminants'!$E100*VLOOKUP($B100,'Calculate Dispersion Factors'!$B$7:$N$11,3,FALSE)/H100","v":3.2224646273632844E-5},{"$f":"'Identify Toxic Air Contaminants'!$E100*VLOOKUP($B100,'Calculate Dispersion Factors'!$B$7:$N$11,4,FALSE)/I100","v":4.7911093027978337E-6},{"$f":"'Identify Toxic Air Contaminants'!$E100*VLOOKUP($B100,'Calculate Dispersion Factors'!$B$7:$N$11,5,FALSE)/J100","v":7.2592565193906576E-4},{"$f":"'Identify Toxic Air Contaminants'!$F100*VLOOKUP($B100,'Calculate Dispersion Factors'!$B$7:$N$11,6,FALSE)/K100","v":9.3342768760749286E-3}]
[null,"ASR-1 Piles","Manganese and compounds","7439-96-5","--","--","--",0.09,0.4,0.4,0.3,"--","--","--",{"$f":"'Identify Toxic Air Contaminants'!$E101*VLOOKUP($B101,'Calculate Dispersion Factors'!$B$7:$N$11,3,FALSE)/H101","v":2.5325979183444197E-6},{"$f":"'Identify Toxic Air Contaminants'!$E101*VLOOKUP($B101,'Calculate Dispersion Factors'!$B$7:$N$11,4,FALSE)/I101","v":3.7277721562415379E-7},{"$f":"'Identify Toxic Air Contaminants'!$E101*VLOOKUP($B101,'Calculate Dispersion Factors'!$B$7:$N$11,5,FALSE)/J101","v":5.6481396306689976E-5},{"$f":"'Identify Toxic Air Contaminants'!$F101*VLOOKUP($B101,'Calculate Dispersion Factors'!$B$7:$N$11,6,FALSE)/K101","v":2.2007971772469766E-4}]
[null,"ASR-1 Piles","Mercury and compounds","7439-97-6","--","--","--",7.6999999999999999E-2,0.63,0.63,0.6,"--","--","--",{"$f":"'Identify Toxic Air Contaminants'!$E102*VLOOKUP($B102,'Calculate Dispersion Factors'!$B$7:$N$11,3,FALSE)/H102","v":3.5175806221218118E-9},{"$f":"'Identify Toxic Air Contaminants'!$E102*VLOOKUP($B102,'Calculate Dispersion Factors'!$B$7:$N$11,4,FALSE)/I102","v":2.8125149027097305E-10},{"$f":"'Identify Toxic Air Contaminants'!$E102*VLOOKUP($B102,'Calculate Dispersion Factors'!$B$7:$N$11,5,FALSE)/J102","v":4.2613862162268645E-8},{"$f":"'Identify Toxic Air Contaminants'!$F102*VLOOKUP($B102,'Calculate Dispersion Factors'!$B$7:$N$11,6,FALSE)/K102","v":1.3076034416915311E-7}]
[null,"ASR-1 Piles","Nickel compounds, insoluble","365",3.8E-3,0.1,4.5999999999999999E-2,1.4E-2,6.2E-2,6.2E-2,0.2,{"$f":"'Identify Toxic Air Contaminants'!$E103*VLOOKUP($B103,'Calculate Dispersion Factors'!$B$7:$N$11,3,FALSE)/E103","v":4.2766374932112555E-5},{"$f":"'Identify Toxic Air Contaminants'!$E103*VLOOKUP($B103,'Calculate Dispersion Factors'!$B$7:$N$11,4,FALSE)/F103","v":1.0631306332242781E-6},{"$f":"'Identify Toxic Air Contaminants'!$E103*VLOOKUP($B103,'Calculate Dispersion Factors'!$B$7:$N$11,5,FALSE)/G103","v":3.5017478037690326E-4},{"$f":"'Identify Toxic Air Contaminants'!$E103*VLOOKUP($B103,'Calculate Dispersion Factors'!$B$7:$N$11,3,FALSE)/H103","v":1.1608016053001979E-5},{"$f":"'Identify Toxic Air Contaminants'!$E103*VLOOKUP($B103,'Calculate Dispersion Factors'!$B$7:$N$11,4,FALSE)/I103","v":1.7147268277810938E-6},{"$f":"'Identify Toxic Air Contaminants'!$E103*VLOOKUP($B103,'Calculate Dispersion Factors'!$B$7:$N$11,5,FALSE)/J103","v":2.5980709511834758E-4},{"$f":"'Identify Toxic Air Contaminants'!$F103*VLOOKUP($B103,'Calculate Dispersion Factors'!$B$7:$N$11,6,FALSE)/K103","v":2.3536861950447556E-4}]
[null,"ASR-1 Piles","Zinc and compounds","NoRBC","--","--","--","--","--","--","--"]
[null,"ASR-1 Piles","Polychlorinated biphenyls (PCBs)","1336-36-3",5.2999999999999998E-4,0.02,9.1999999999999998E-3,"--","--","--","--",{"$f":"'Identify Toxic Air Contaminants'!$E105*VLOOKUP($B105,'Calculate Dispersion Factors'!$B$7:$N$11,3,FALSE)/E105","v":1.2579562631216464E-5},{"$f":"'Identify Toxic Air Contaminants'!$E105*VLOOKUP($B105,'Calculate Dispersion Factors'!$B$7:$N$11,4,FALSE)/F105","v":2.1807807861010832E-7},{"$f":"'Identify Toxic Air Contaminants'!$E105*VLOOKUP($B105,'Calculate Dispersion Factors'!$B$7:$N$11,5,FALSE)/G105","v":7.1830724179877572E-5},"--","--","--","--"]
[null,"ASR-1 Piles","Polychlorinated biphenyls (PCBs) TEQ","645",1.0000000000000001E-9,8.9999999999999999E-8,4.1999999999999999E-8,1.3E-7,2.5999999999999998E-5,2.5999999999999998E-5,"--",{"$f":"'Identify Toxic Air Contaminants'!$E106*VLOOKUP($B106,'Calculate Dispersion Factors'!$B$7:$N$11,3,FALSE)/E106","v":8.3339602431809092E-5},{"$f":"'Identify Toxic Air Contaminants'!$E106*VLOOKUP($B106,'Calculate Dispersion Factors'!$B$7:$N$11,4,FALSE)/F106","v":6.0577244058363436E-7},{"$f":"'Identify Toxic Air Contaminants'!$E106*VLOOKUP($B106,'Calculate Dispersion Factors'!$B$7:$N$11,5,FALSE)/G106","v":1.966793638258553E-4},{"$f":"'Identify Toxic Air Contaminants'!$E106*VLOOKUP($B106,'Calculate Dispersion Factors'!$B$7:$N$11,3,FALSE)/H106","v":6.4107386486006989E-7},{"$f":"'Identify Toxic Air Contaminants'!$E106*VLOOKUP($B106,'Calculate Dispersion Factors'!$B$7:$N$11,4,FALSE)/I106","v":2.0969046020202727E-9},{"$f":"'Identify Toxic Air Contaminants'!$E106*VLOOKUP($B106,'Calculate Dispersion Factors'!$B$7:$N$11,5,FALSE)/J106","v":3.177128184879201E-7},"--"]
[null,"ASR-1 Piles","Polychlorinated dibenzo-p-dioxins (PCDDs) & dibenzofurans (PCDFs) TEQ","646",1.0000000000000001E-9,8.9999999999999999E-8,4.1999999999999999E-8,1.3E-7,2.5999999999999998E-5,2.5999999999999998E-5,"--",{"$f":"'Identify Toxic Air Contaminants'!$E107*VLOOKUP($B107,'Calculate Dispersion Factors'!$B$7:$N$11,3,FALSE)/E107","v":9.167356267498999E-5},{"$f":"'Identify Toxic Air Contaminants'!$E107*VLOOKUP($B107,'Calculate Dispersion Factors'!$B$7:$N$11,4,FALSE)/F107","v":6.6634968464199772E-7},{"$f":"'Identify Toxic Air Contaminants'!$E107*VLOOKUP($B107,'Calculate Dispersion Factors'!$B$7:$N$11,5,FALSE)/G107","v":2.1634730020844082E-4},{"$f":"'Identify Toxic Air Contaminants'!$E107*VLOOKUP($B107,'Calculate Dispersion Factors'!$B$7:$N$11,3,FALSE)/H107","v":7.0518125134607691E-7},{"$f":"'Identify Toxic Air Contaminants'!$E107*VLOOKUP($B107,'Calculate Dispersion Factors'!$B$7:$N$11,4,FALSE)/I107","v":2.3065950622222999E-9},{"$f":"'Identify Toxic Air Contaminants'!$E107*VLOOKUP($B107,'Calculate Dispersion Factors'!$B$7:$N$11,5,FALSE)/J107","v":3.4948410033671214E-7},"--"]
[null,"ASR-1 Piles","Polychlorinated naphthalenes","NoRBC","--","--","--","--","--","--","--"]
[null,"ASR-1 Piles","Hexachlorobenzene","118-74-1",2E-3,5.0999999999999997E-2,2.4E-2,"--","--","--","--",{"$f":"'Identify Toxic Air Contaminants'!$E109*VLOOKUP($B109,'Calculate Dispersion Factors'!$B$7:$N$11,3,FALSE)/E109","v":2.2918390668747497E-7},{"$f":"'Identify Toxic Air Contaminants'!$E109*VLOOKUP($B109,'Calculate Dispersion Factors'!$B$7:$N$11,4,FALSE)/F109","v":5.8795560409588037E-9},{"$f":"'Identify Toxic Air Contaminants'!$E109*VLOOKUP($B109,'Calculate Dispersion Factors'!$B$7:$N$11,5,FALSE)/G109","v":1.8930388768238572E-6},"--","--","--","--"]
[null,"ASR-1 Piles","PBDDs/PBDFs","NoRBC","--","--","--","--","--","--","--"]
[null,"ASR-1 Piles","Polybrominated diphenyl ethers (PBDEs)","447","--","--","--","--","--","--",6,"--","--","--","--","--","--",{"$f":"'Identify Toxic Air Contaminants'!$F111*VLOOKUP($B111,'Calculate Dispersion Factors'!$B$7:$N$11,6,FALSE)/K111","v":3.5204708045541222E-6}]
[null,"ASR-1 Piles","Hexabromocyclododecane","NoRBC","--","--","--","--","--","--","--"]
[null,"ASR-1 Piles","Polycyclic aromatic hydrocarbons (PAHs)","401",4.3000000000000002E-5,1.6000000000000001E-3,3.0000000000000001E-3,"--","--","--","--",{"$f":"'Identify Toxic Air Contaminants'!$E113*VLOOKUP($B113,'Calculate Dispersion Factors'!$B$7:$N$11,3,FALSE)/E113","v":2.9023501079449791E-4},{"$f":"'Identify Toxic Air Contaminants'!$E113*VLOOKUP($B113,'Calculate Dispersion Factors'!$B$7:$N$11,4,FALSE)/F113","v":5.1026862924787067E-6},{"$f":"'Identify Toxic Air Contaminants'!$E113*VLOOKUP($B113,'Calculate Dispersion Factors'!$B$7:$N$11,5,FALSE)/G113","v":4.123382862609056E-4},"--","--","--","--"]
[null,"ASR-1 Piles","Bis(2-ethylhexyl) phthalate (DEHP)","117-81-7",0.08,11,5,"--","--","--","--",{"$f":"'Identify Toxic Air Contaminants'!$E114*VLOOKUP($B114,'Calculate Dispersion Factors'!$B$7:$N$11,3,FALSE)/E114","v":4.3232418761500964E-8},{"$f":"'Identify Toxic Air Contaminants'!$E114*VLOOKUP($B114,'Calculate Dispersion Factors'!$B$7:$N$11,4,FALSE)/F114","v":2.0568727868907946E-10},{"$f":"'Identify Toxic Air Contaminants'!$E114*VLOOKUP($B114,'Calculate Dispersion Factors'!$B$7:$N$11,5,FALSE)/G114","v":6.8562426229693153E-8},"--","--","--","--"]
[null,"Drain","2,2,4 Trimethylpentane","NoRBC","--","--","--","--","--","--","--"]
[null,"Drain","Benzene","71-43-2",0.13,3.3,1.5,3,13,13,29,{"$f":"'Identify Toxic Air Contaminants'!$E116*VLOOKUP($B116,'Calculate Dispersion Factors'!$B$7:$N$11,3,FALSE)/E116","v":4.6962366989252539E-3},{"$f":"'Identify Toxic Air Contaminants'!$E116*VLOOKUP($B116,'Calculate Dispersion Factors'!$B$7:$N$11,4,FALSE)/F116","v":1.2102636426745698E-4},{"$f":"'Identify Toxic Air Contaminants'!$E116*VLOOKUP($B116,'Calculate Dispersion Factors'!$B$7:$N$11,5,FALSE)/G116","v":4.0342121422485659E-2},{"$f":"'Identify Toxic Air Contaminants'!$E116*VLOOKUP($B116,'Calculate Dispersion Factors'!$B$7:$N$11,3,FALSE)/H116","v":2.0350359028676102E-4},{"$f":"'Identify Toxic Air Contaminants'!$E116*VLOOKUP($B116,'Calculate Dispersion Factors'!$B$7:$N$11,4,FALSE)/I116","v":3.0722077083277541E-5},{"$f":"'Identify Toxic Air Contaminants'!$E116*VLOOKUP($B116,'Calculate Dispersion Factors'!$B$7:$N$11,5,FALSE)/J116","v":4.6548601641329609E-3},{"$f":"'Identify Toxic Air Contaminants'!$F116*VLOOKUP($B116,'Calculate Dispersion Factors'!$B$7:$N$11,6,FALSE)/K116","v":6.5100643617186996E-3}]
[null,"Drain","Ethylbenzene","NoRBC","--","--","--","--","--","--","--"]
[null,"Drain","Hexane","110-54-3","--","--","--",700,3100,3100,"--","--","--","--",{"$f":"'Identify Toxic Air Contaminants'!$E118*VLOOKUP($B118,'Calculate Dispersion Factors'!$B$7:$N$11,3,FALSE)/H118","v":1.7443164881722372E-6},{"$f":"'Identify Toxic Air Contaminants'!$E118*VLOOKUP($B118,'Calculate Dispersion Factors'!$B$7:$N$11,4,FALSE)/I118","v":2.5766903360168259E-7},{"$f":"'Identify Toxic Air Contaminants'!$E118*VLOOKUP($B118,'Calculate Dispersion Factors'!$B$7:$N$11,5,FALSE)/J118","v":3.9040762666921606E-5},"--"]
[null,"Drain","Toluene","108-88-3","--","--","--",5000,22000,22000,7500,"--","--","--",{"$f":"'Identify Toxic Air Contaminants'!$E119*VLOOKUP($B119,'Calculate Dispersion Factors'!$B$7:$N$11,3,FALSE)/H119","v":2.2200391667646655E-7},{"$f":"'Identify Toxic Air Contaminants'!$E119*VLOOKUP($B119,'Calculate Dispersion Factors'!$B$7:$N$11,4,FALSE)/I119","v":3.3007190254760994E-8},{"$f":"'Identify Toxic Air Contaminants'!$E119*VLOOKUP($B119,'Calculate Dispersion Factors'!$B$7:$N$11,5,FALSE)/J119","v":5.001089432539544E-6},{"$f":"'Identify Toxic Air Contaminants'!$F119*VLOOKUP($B119,'Calculate Dispersion Factors'!$B$7:$N$11,6,FALSE)/K119","v":4.5767725209658727E-5}]
[null,"Drain","Xylenes","NoRBC","--","--","--","--","--","--","--"]

{"sheet":"RBCs","index":6,"n_rows":265,"n_cols":10,"rows_kept":265,"cut":false,"hidden":false,"merged":[[1,1,3,1],[1,2,3,2],[1,3,1,4],[1,5,1,8],[1,0,3,0]]}
[]
[null,"CAS#","Chemical","Residential",null,"Non-Residential",null,null,null,"Acute "]
[null,null,null,"Cancer","Noncancer","Child Cancer","Child Noncancer","Worker Cancer","Worker Noncancer","Acute "]
[null,null,null,"(µg/m3)","(µg/m3)","(µg/m3)","(µg/m3)","(µg/m3)","(µg/m3)","(µg/m3)"]
[null,"75-07-0","Acetaldehyde",0.45,140,12,620,5.5,620,470]
[null,"60-35-5","Acetamide",0.05,"--",1.3,"--",0.6,"--","--"]
[null,"67-64-1","Acetone","--",31000,"--",140000,"--",140000,62000]
[null,"75-05-8","Acetonitrile","--",60,"--",260,"--",260,"--"]
[null,"107-02-8","Acrolein","--",0.35,"--",1.5,"--",1.5,6.9]
[null,"79-06-1","Acrylamide",5.8999999999999999E-3,6,6.2E-2,26,0.12,26,"--"]
[null,"79-10-7","Acrylic acid","--",1,"--",4.4000000000000004,"--",4.4000000000000004,6000]
[null,"107-13-1","Acrylonitrile",1.4999999999999999E-2,5,0.38,22,0.18,22,220]
[null,"309-00-2","Aldrin",2.0000000000000001E-4,"--",5.3E-3,"--",2.3999999999999998E-3,"--","--"]
[null,"107-05-1","Allyl chloride",0.17,1,4.3,4.4000000000000004,2,4.4000000000000004,"--"]
[null,"7429-90-5","Aluminum and compounds","--",5,"--",22,"--",22,"--"]
[null,"7664-41-7","Ammonia","--",500,"--",2200,"--",2200,1200]
[null,"62-53-3","Aniline",0.63,1,16,4.4000000000000004,7.5,4.4000000000000004,"--"]
[null,"7440-36-0","Antimony and compounds","--",0.3,"--",1.3,"--",1.3,1]
[null,"140-57-8","Aramite",0.14000000000000001,"--",3.7,"--",1.7,"--","--"]
[null,"7440-38-2","Arsenic and compounds",2.4000000000000001E-5,1.7000000000000001E-4,1.2999999999999999E-3,2.3999999999999998E-3,6.2E-4,2.3999999999999998E-3,0.2]
[null,"7784-42-1","Arsine","--",1.4999999999999999E-2,"--",6.6000000000000003E-2,"--",6.6000000000000003E-2,0.2]
[null,"1332-21-4","Asbestos",4.3000000000000003E-6,"--",1.1E-4,"--",5.1999999999999997E-5,"--","--"]
[null,"103-33-3","Azobenzene",3.2000000000000001E-2,"--",0.84,"--",0.39,"--","--"]
[null,"71-43-2","Benzene",0.13,3,3.3,13,1.5,13,29]
[null,"92-87-5","Benzidine (and its salts)",4.1999999999999996E-6,"--",4.3999999999999999E-5,"--",8.6000000000000003E-5,"--","--"]
[null,"100-44-7","Benzyl chloride",0.02,1,0.53,4.4000000000000004,0.24,4.4000000000000004,240]
[null,"7440-41-7","Beryllium and compounds",4.2000000000000002E-4,7.0000000000000001E-3,1.0999999999999999E-2,3.1E-2,5.0000000000000001E-3,3.1E-2,0.02]
[null,"111-44-4","Bis(2-chloroethyl) ether (DCEE)",1.4E-3,"--",3.6999999999999998E-2,"--",1.7000000000000001E-2,"--",120]
[null,"542-88-1","Bis(chloromethyl) ether",7.7000000000000001E-5,"--",2E-3,"--",9.2000000000000003E-4,"--",1.4]
[null,"117-81-7","Bis(2-ethylhexyl) phthalate (DEHP)",0.08,"--",11,"--",5,"--","--"]
[null,"75-25-2","Bromoform",0.91,"--",24,"--",11,"--","--"]
[null,"74-83-9","Bromomethane (Methyl bromide)","--",5,"--",22,"--",22,3900]
[null,"106-94-5","1-Bromopropane (n-propyl bromide)",0.48,33,12,150,5.7,150,1700]
[null,"106-99-0","1,3-Butadiene",3.3000000000000002E-2,2,0.86,8.8000000000000007,0.4,8.8000000000000007,660]
[null,"78-93-3","2-Butanone (Methyl ethyl ketone)","--",5000,"--",22000,"--",22000,5000]
[null,"78-92-2","sec-Butyl alcohol","--",30000,"--",130000,"--",130000,"--"]
[null,"7440-43-9","Cadmium and compounds",5.5999999999999995E-4,5.0000000000000001E-3,1.4E-2,3.6999999999999998E-2,6.7000000000000002E-3,3.6999999999999998E-2,0.03]
[null,"105-60-2","Caprolactam","--",2.2000000000000002,"--",9.6999999999999993,"--",9.6999999999999993,50]
[null,"75-15-0","Carbon disulfide","--",800,"--",3500,"--",3500,6200]
[null,"56-23-5","Carbon tetrachloride",0.17,100,4.3,440,2,440,1900]
[null,"463-58-1","Carbonyl sulfide","--",10,"--",44,"--",44,660]
[null,"57-74-9","Chlordane",0.01,0.02,0.26,8.7999999999999995E-2,0.12,8.7999999999999995E-2,0.2]
[null,"108171-26-2","Chlorinated paraffins",0.04,"--",1,"--",0.48,"--","--"]
[null,"7782-50-5","Chlorine","--",0.15,"--",0.66,"--",0.66,170]
[null,"10049-04-4","Chlorine dioxide","--",0.6,"--",2.6,"--",2.6,2.8]
[null,"532-27-4","2-Chloroacetophenone","--",0.03,"--",0.13,"--",0.13,"--"]
[null,"108-90-7","Chlorobenzene","--",50,"--",220,"--",220,"--"]
[null,"75-68-3","1-Chloro-1,1-difluoroethane","--",50000,"--",220000,"--",220000,"--"]
[null,"75-45-6","Chlorodifluoromethane (Freon 22)","--",50000,"--",220000,"--",220000,"--"]
[null,"75-00-3","Chloroethane (Ethyl chloride)","--",30000,"--",130000,"--",130000,40000]
[null,"67-66-3","Chloroform","--",300,"--",1300,"--",1300,490]
[null,"74-87-3","Chloromethane (Methyl chloride)","--",90,"--",400,"--",400,1000]
[null,"95-83-0","4-Chloro-o-phenylenediamine",0.22,"--",5.7,"--",2.6,"--","--"]
[null,"76-06-2","Chloropicrin","--",0.4,"--",1.8,"--",1.8,29]
[null,"126-99-8","Chloroprene",3.3E-3,20,8.6999999999999994E-2,88,0.04,88,"--"]
[null,"95-69-2","p-Chloro-o-toluidine",1.2999999999999999E-2,"--",0.34,"--",0.16,"--","--"]
[null,"18540-29-9","Chromium VI, chromate and dichromate particulate",3.1000000000000001E-5,8.3000000000000004E-2,5.1999999999999995E-4,0.88,1E-3,0.88,0.3]
[null,"7738-94-5","Chromium VI, chromic acid aerosol mist",3.1000000000000001E-5,2.0999999999999999E-3,5.1999999999999995E-4,2.1999999999999999E-2,1E-3,2.1999999999999999E-2,5.0000000000000001E-3]
[null,"7440-48-4","Cobalt and compounds","--",0.1,"--",0.44,"--",0.44,"--"]
[null,"148","Coke Oven Emissions",9.5E-4,"--",0.01,"--",1.9E-2,"--","--"]
[null,"7440-50-8","Copper and compounds","--","--","--","--","--","--",100]
[null,"120-71-8","p-Cresidine",2.3E-2,"--",0.6,"--",0.28000000000000003,"--","--"]
[null,"1319-77-3","Cresols (mixture), including m-cresol, o-cresol, p-cresol","--",600,"--",2600,"--",2600,"--"]
[null,"135-20-6","Cupferron",1.6E-2,"--",0.41,"--",0.19,"--","--"]
[null,"74-90-8","Cyanide, Hydrogen","--",0.8,"--",3.5,"--",3.5,340]
[null,"110-82-7","Cyclohexane","--",6000,"--",26000,"--",26000,"--"]
[null,"50-29-3","DDT",0.01,"--",0.27,"--",0.12,"--","--"]
[null,"615-05-4","2,4-Diaminoanisole",0.15,"--",3.9,"--",1.8,"--","--"]
[null,"95-80-7","2,4-Diaminotoluene (2,4-Toluene diamine)",9.1E-4,"--",2.4E-2,"--",1.0999999999999999E-2,"--","--"]
[null,"333-41-5","Diazinon","--","--","--","--","--","--",10]
[null,"96-12-8","1,2-Dibromo-3-chloropropane (DBCP)",9.7999999999999997E-5,0.2,1E-3,0.88,2E-3,0.88,1.9]
[null,"106-46-7","p-Dichlorobenzene (1,4-Dichlorobenzene)",9.0999999999999998E-2,60,2.4,260,1.1000000000000001,260,12000]
[null,"91-94-1","3,3'-Dichlorobenzidine",2.8999999999999998E-3,"--",7.5999999999999998E-2,"--",3.5000000000000003E-2,"--","--"]
[null,"75-34-3","1,1-Dichloroethane (Ethylidene dichloride)",0.63,"--",16,"--",7.5,"--","--"]
[null,"156-60-5","trans-1,2-dichloroethene","--","--","--","--","--","--",790]
[null,"75-09-2","Dichloromethane (Methylene chloride)",59,600,620,2600,1200,2600,2100]
[null,"78-87-5","1,2-Dichloropropane (Propylene dichloride)","--",4,"--",18,"--",18,230]
[null,"542-75-6","1,3-Dichloropropene",0.25,32,6.5,140,3,140,36]
[null,"62-73-7","Dichlorovos (DDVP)","--",0.54,"--",2.4,"--",2.4,18]
[null,"60-57-1","Dieldrin",2.2000000000000001E-4,"--",5.7000000000000002E-3,"--",2.5999999999999999E-3,"--","--"]
[null,"200","Diesel Particulate Matter",0.1,5,2.6,22,1.2,22,"--"]
[null,"111-42-2","Diethanolamine","--",0.2,"--",0.88,"--",0.88,"--"]
[null,"112-34-5","Diethylene glycol monobutyl ether","--",0.1,"--",0.44,"--",0.44,"--"]
[null,"111-90-0","Diethylene glycol monoethyl ether","--",0.3,"--",1.3,"--",1.3,"--"]
[null,"75-37-6","1,1-Difluoroethane","--",40000,"--",180000,"--",180000,"--"]
[null,"60-11-7","4-Dimethylaminoazobenzene",7.6999999999999996E-4,"--",0.02,"--",9.1999999999999998E-3,"--","--"]
[null,"68-12-2","Dimethyl formamide","--",80,"--",350,"--",350,"--"]
[null,"57-14-7","1,1-Dimethylhydrazine","--","--","--","--","--","--",0.49]
[null,"121-14-2","2,4-Dinitrotoluene",1.0999999999999999E-2,"--",0.28999999999999998,"--",0.13,"--","--"]
[null,"123-91-1","1,4-Dioxane",0.2,30,5.2,130,2.4,130,7200]
[null,"122-66-7","1,2-Diphenylhydrazine (Hydrazobenzene)",4.4999999999999997E-3,"--",0.12,"--",5.5E-2,"--","--"]
[null,"1937-37-7","Direct Black 38",7.0999999999999998E-6,"--",1.9000000000000001E-4,"--",8.6000000000000003E-5,"--","--"]
[null,"2602-46-2","Direct Blue 6",7.0999999999999998E-6,"--",1.9000000000000001E-4,"--",8.6000000000000003E-5,"--","--"]
[null,"16071-86-6","Direct Brown 95 (technical grade)",7.0999999999999998E-6,"--",1.9000000000000001E-4,"--",8.6000000000000003E-5,"--","--"]
[null,"298-04-4","Disulfoton","--","--","--","--","--","--",6]
[null,"106-89-8","Epichlorohydrin",4.2999999999999997E-2,3,1.1000000000000001,13,0.52,13,1300]
[null,"106-88-7","1,2-Epoxybutane","--",20,"--",88,"--",88,"--"]
[null,"140-88-5","Ethyl acrylate","--",8,"--",35,"--",35,"--"]
[null,"100-41-4","Ethyl benzene",0.4,260,10,1100,4.8,1100,22000]
[null,"106-93-4","Ethylene dibromide (EDB, 1,2-Dibromoethane)",1.6999999999999999E-3,9,4.2999999999999997E-2,40,0.02,40,"--"]
[null,"107-06-2","Ethylene dichloride (EDC, 1,2-Dichloroethane)",3.7999999999999999E-2,7,1,31,0.46,31,"--"]
[null,"107-21-1","Ethylene glycol","--",400,"--",1800,"--",1800,2000]
[null,"111-76-2","Ethylene glycol monobutyl ether","--",82,"--",360,"--",360,29000]
[null,"110-80-5","Ethylene glycol monoethyl ether","--",70,"--",310,"--",310,370]
[null,"111-15-9","Ethylene glycol monoethyl ether acetate","--",60,"--",260,"--",260,140]
[null,"109-86-4","Ethylene glycol monomethyl ether","--",60,"--",260,"--",260,93]
[null,"110-49-6","Ethylene glycol monomethyl ether acetate","--",1,"--",4.4000000000000004,"--",4.4000000000000004,"--"]
[null,"75-21-8","Ethylene oxide",2.0000000000000001E-4,30,2.0999999999999999E-3,130,4.0000000000000001E-3,130,160]
[null,"96-45-7","Ethylene thiourea",7.6999999999999999E-2,"--",2,"--",0.92,"--","--"]
[null,"239","Fluorides","--",2.2999999999999998,"--",20,"--",20,240]
[null,"7782-41-4","Fluorine gas","--","--","--","--","--","--",16]
[null,"50-00-0","Formaldehyde",0.17,9,4.3,40,2,40,49]
[null,"111-30-8","Glutaraldehyde","--",0.08,"--",0.35,"--",0.35,4.0999999999999996]
[null,"76-44-8","Heptachlor",7.6999999999999996E-4,"--",0.02,"--",9.1999999999999998E-3,"--","--"]
[null,"1024-57-3","Heptachlor epoxide",3.8000000000000002E-4,"--",0.01,"--",4.5999999999999999E-3,"--","--"]
[null,"118-74-1","Hexachlorobenzene",2E-3,"--",5.0999999999999997E-2,"--",2.4E-2,"--","--"]
[null,"87-68-3","Hexachlorobutadiene",4.4999999999999998E-2,"--",1.2,"--",0.55000000000000004,"--","--"]
[null,"608-73-1","Hexachlorocyclohexanes (mixture) including but not limited to:",1.7000000000000001E-4,"--",1.7999999999999999E-2,"--",8.3999999999999995E-3,"--","--"]
[null,"319-84-6","Hexachlorocyclohexane, alpha-",1.7000000000000001E-4,"--",1.7999999999999999E-2,"--",8.3999999999999995E-3,"--","--"]
[null,"319-85-7","Hexachlorocyclohexane, beta-",1.7000000000000001E-4,"--",1.7999999999999999E-2,"--",8.3999999999999995E-3,"--","--"]
[null,"58-89-9","Hexachlorocyclohexane, gamma- (Lindane)",5.9999999999999995E-4,"--",6.5000000000000002E-2,"--",0.03,"--","--"]
[null,"77-47-4","Hexachlorocyclopentadiene","--",0.2,"--",0.88,"--",0.88,110]
[null,"67-72-1","Hexachloroethane","--",30,"--",130,"--",130,58000]
[null,"822-06-0","Hexamethylene-1,6-diisocyanate","--",6.9000000000000006E-2,"--",0.3,"--",0.3,0.21]
[null,"110-54-3","Hexane","--",700,"--",3100,"--",3100,"--"]
[null,"302-01-2","Hydrazine",2.0000000000000001E-4,0.03,5.3E-3,0.13,2.3999999999999998E-3,0.13,5.2]
[null,"7647-01-0","Hydrochloric acid","--",20,"--",88,"--",88,2100]
[null,"7664-39-3","Hydrogen fluoride","--",2.1,"--",19,"--",19,16]
[null,"7783-06-4","Hydrogen sulfide","--",2,"--",8.8000000000000007,"--",8.8000000000000007,98]
[null,"78-59-1","Isophorone","--",2000,"--",8800,"--",8800,"--"]
[null,"67-63-0","Isopropyl alcohol","--",200,"--",880,"--",880,3200]
[null,"98-82-8","Isopropylbenzene (Cumene)","--",400,"--",1800,"--",1800,"--"]
[null,"7439-92-1","Lead and compounds","--",0.15,"--",0.66,"--",0.66,0.15]
[null,"108-31-6","Maleic anhydride","--",0.7,"--",3.1,"--",3.1,"--"]
[null,"7439-96-5","Manganese and compounds","--",0.09,"--",0.4,"--",0.4,0.3]
[null,"7439-97-6","Mercury and compounds","--",7.6999999999999999E-2,"--",0.63,"--",0.63,0.6]
[null,"67-56-1","Methanol","--",4000,"--",18000,"--",18000,28000]
[null,"101-14-4","4,4'-Methylene bis(2-chloroaniline) (MOCA)",2.3E-3,"--",0.06,"--",2.8000000000000001E-2,"--","--"]
[null,"101-77-9","4,4'-Methylenedianiline (and its dichloride)",2.9999999999999997E-4,20,2.3E-2,88,0.01,88,"--"]
[null,"101-68-8","Methylene diphenyl diisocyanate (MDI)","--",0.08,"--",0.35,"--",0.35,12]
[null,"108-10-1","Methyl isobutyl ketone (MIBK, Hexone)","--",3000,"--",13000,"--",13000,"--"]
[null,"624-83-9","Methyl isocyanate","--",1,"--",4.4000000000000004,"--",4.4000000000000004,"--"]
[null,"80-62-6","Methyl methacrylate","--",700,"--",3100,"--",3100,"--"]
[null,"1634-04-4","Methyl tert-butyl ether",3.8,8000,100,35000,46,35000,8000]
[null,"90-94-8","Michler's ketone",4.0000000000000001E-3,"--",0.1,"--",4.8000000000000001E-2,"--","--"]
[null,"91-20-3","Naphthalene",2.9000000000000001E-2,3.7,0.76,16,0.35,16,200]
[null,"365","Nickel compounds, insoluble",3.8E-3,1.4E-2,0.1,6.2E-2,4.5999999999999999E-2,6.2E-2,0.2]
[null,"368","Nickel compounds, soluble","--",1.4E-2,"--",6.2E-2,"--",6.2E-2,0.2]
[null,"7697-37-2","Nitric acid","--","--","--","--","--","--",86]
[null,"98-95-3","Nitrobenzene",2.5000000000000001E-2,9,0.65,40,0.3,40,"--"]
[null,"79-46-9","2-Nitropropane","--",20,"--",88,"--",88,"--"]
[null,"924-16-3","N-Nitrosodi-n-butylamine",3.2000000000000003E-4,"--",8.3999999999999995E-3,"--",3.8999999999999998E-3,"--","--"]
[null,"55-18-5","N-Nitrosodiethylamine",5.8999999999999998E-5,"--",6.2E-4,"--",1.1999999999999999E-3,"--","--"]
[null,"62-75-9","N-Nitrosodimethylamine",1.2999999999999999E-4,"--",1.2999999999999999E-3,"--",2.5999999999999999E-3,"--","--"]
[null,"86-30-6","N-Nitrosodiphenylamine",0.38,"--",10,"--",4.5999999999999996,"--","--"]
[null,"156-10-5","p-Nitrosodiphenylamine",0.16,"--",4.0999999999999996,"--",1.9,"--","--"]
[null,"621-64-7","N-Nitrosodi-n-propylamine",5.0000000000000001E-4,"--",1.2999999999999999E-2,"--",6.0000000000000001E-3,"--","--"]
[null,"10595-95-6","N-Nitrosomethylethylamine",1.6000000000000001E-4,"--",4.1000000000000003E-3,"--",1.9E-3,"--","--"]
[null,"59-89-2","N-Nitrosomorpholine",5.2999999999999998E-4,"--",1.4E-2,"--",6.3E-3,"--","--"]
[null,"100-75-4","N-Nitrosopiperidine",3.6999999999999999E-4,"--",9.5999999999999992E-3,"--",4.4000000000000003E-3,"--","--"]
[null,"930-55-2","N-Nitrosopyrrolidine",1.6999999999999999E-3,"--",4.2999999999999997E-2,"--",0.02,"--","--"]
[null,"8014-95-7","Oleum (fuming sulfuric acid)","--","--","--","--","--","--",120]
[null,"56-38-2","Parathion","--","--","--","--","--","--",0.02]
[null,"87-86-5","Pentachlorophenol",0.2,"--",5.0999999999999996,"--",2.4,"--","--"]
[null,"108-95-2","Phenol","--",200,"--",880,"--",880,5800]
[null,"75-44-5","Phosgene","--",0.3,"--",1.3,"--",1.3,4]
[null,"7803-51-2","Phosphine","--",0.8,"--",3.5,"--",3.5,"--"]
[null,"7664-38-2","Phosphoric acid","--",10,"--",44,"--",44,"--"]
[null,"12185-10-3","Phosphorus, white","--",9,"--",40,"--",40,20]
[null,"85-44-9","Phthalic anhydride","--",20,"--",88,"--",88,"--"]
[null,"447","Polybrominated diphenyl ethers (PBDEs)","--","--","--","--","--","--",6]
[null,"1336-36-3","Polychlorinated biphenyls (PCBs)",5.2999999999999998E-4,"--",0.02,"--",9.1999999999999998E-3,"--","--"]
[null,"645","Polychlorinated biphenyls (PCBs) TEQ",1.0000000000000001E-9,1.3E-7,8.9999999999999999E-8,2.5999999999999998E-5,4.1999999999999999E-8,2.5999999999999998E-5,"--"]
[null,"32598-13-3","PCB 77 [3,3',4,4'-tetrachlorobiphenyl]",1.0000000000000001E-5,1.2999999999999999E-3,8.9999999999999998E-4,0.26,4.2000000000000002E-4,0.26,"--"]
[null,"70362-50-4","PCB 81 [3,4,4',5-tetrachlorobiphenyl]",3.4000000000000001E-6,4.2000000000000002E-4,2.9999999999999997E-4,8.5000000000000006E-2,1.3999999999999999E-4,8.5000000000000006E-2,"--"]
[null,"32598-14-4","PCB 105 [2,3,3',4,4'-pentachlorobiphenyl]",3.4E-5,4.1999999999999997E-3,3.0000000000000001E-3,0.85,1.4E-3,0.85,"--"]
[null,"74472-37-0","PCB 114 [2,3,4,4',5-pentachlorobiphenyl]",3.4E-5,4.1999999999999997E-3,3.0000000000000001E-3,0.85,1.4E-3,0.85,"--"]
[null,"31508-00-6","PCB 118 [2,3',4,4',5-pentachlorobiphenyl]",3.4E-5,4.1999999999999997E-3,3.0000000000000001E-3,0.85,1.4E-3,0.85,"--"]
[null,"65510-44-3","PCB 123 [2,3',4,4',5'-pentachlorobiphenyl]",3.4E-5,4.1999999999999997E-3,3.0000000000000001E-3,0.85,1.4E-3,0.85,"--"]
[null,"57465-28-8","PCB 126 [3,3',4,4',5-pentachlorobiphenyl]",1E-8,1.3E-6,8.9999999999999996E-7,2.5999999999999998E-4,4.2E-7,2.5999999999999998E-4,"--"]
[null,"38380-08-4","PCB 156 [2,3,3',4,4',5-hexachlorobiphenyl]",3.4E-5,4.1999999999999997E-3,3.0000000000000001E-3,0.85,1.4E-3,0.85,"--"]
[null,"69782-90-7","PCB 157 [2,3,3',4,4',5'-hexachlorobiphenyl]",3.4E-5,4.1999999999999997E-3,3.0000000000000001E-3,0.85,1.4E-3,0.85,"--"]
[null,"52663-72-6","PCB 167 [2,3',4,4',5,5'-hexachlorobiphenyl]",3.4E-5,4.1999999999999997E-3,3.0000000000000001E-3,0.85,1.4E-3,0.85,"--"]
[null,"32774-16-6","PCB 169 [3,3',4,4',5,5'-hexachlorobiphenyl]",3.4E-8,4.1999999999999996E-6,3.0000000000000001E-6,8.4999999999999995E-4,1.3999999999999999E-6,8.4999999999999995E-4,"--"]
[null,"39635-31-9","PCB 189 [2,3,3',4,4',5,5'-heptachlorobiphenyl]",8.8000000000000003E-4,1.3,2.3E-2,5.7,1.0999999999999999E-2,5.7,"--"]
[null,"646","Polychlorinated dibenzo-p-dioxins (PCDDs) & dibenzofurans (PCDFs) TEQ",1.0000000000000001E-9,1.3E-7,8.9999999999999999E-8,2.5999999999999998E-5,4.1999999999999999E-8,2.5999999999999998E-5,"--"]
[null,"1746-01-6","2,3,7,8-Tetrachlorodibenzo-p-dioxin (TCDD)",1.0000000000000001E-9,1.3E-7,8.9999999999999999E-8,2.5999999999999998E-5,4.1999999999999999E-8,2.5999999999999998E-5,"--"]
[null,"40321-76-4","1,2,3,7,8-Pentachlorodibenzo-p-dioxin (PeCDD)",1.0000000000000001E-9,1.3E-7,8.9999999999999999E-8,2.5999999999999998E-5,4.1999999999999999E-8,2.5999999999999998E-5,"--"]
[null,"39227-28-6","1,2,3,4,7,8-Hexachlorodibenzo-p-dioxin (HxCDD)",1E-8,1.3E-6,8.9999999999999996E-7,2.5999999999999998E-4,4.2E-7,2.5999999999999998E-4,"--"]
[null,"57653-85-7","1,2,3,6,7,8-Hexachlorodibenzo-p-dioxin (HxCDD)",1E-8,1.3E-6,8.9999999999999996E-7,2.5999999999999998E-4,4.2E-7,2.5999999999999998E-4,"--"]
[null,"19408-74-3","1,2,3,7,8,9-Hexachlorodibenzo-p-dioxin (HxCDD)",1E-8,1.3E-6,8.9999999999999996E-7,2.5999999999999998E-4,4.2E-7,2.5999999999999998E-4,"--"]
[null,"35822-46-9","1,2,3,4,6,7,8-Heptachlorodibenzo-p-dioxin (HpCDD)",9.9999999999999995E-8,1.2999999999999999E-5,9.0000000000000002E-6,2.5999999999999999E-3,4.1999999999999996E-6,2.5999999999999999E-3,"--"]
[null,"3268-87-9","Octachlorodibenzo-p-dioxin (OCDD)",3.4000000000000001E-6,4.2000000000000002E-4,2.9999999999999997E-4,8.5000000000000006E-2,1.3999999999999999E-4,8.5000000000000006E-2,"--"]
[null,"51207-31-9","2,3,7,8-Tetrachlorodibenzofuran (TcDF)",1E-8,1.3E-6,8.9999999999999996E-7,2.5999999999999998E-4,4.2E-7,2.5999999999999998E-4,"--"]
[null,"57117-41-6","1,2,3,7,8-Pentachlorodibenzofuran (PeCDF)",3.4E-8,4.1999999999999996E-6,3.0000000000000001E-6,8.4999999999999995E-4,1.3999999999999999E-6,8.4999999999999995E-4,"--"]
[null,"57117-31-4","2,3,4,7,8-Pentachlorodibenzofuran (PeCDF)",3.3999999999999998E-9,4.2E-7,2.9999999999999999E-7,8.5000000000000006E-5,1.4000000000000001E-7,8.5000000000000006E-5,"--"]
[null,"70648-26-9","1,2,3,4,7,8-Hexachlorodibenzofuran (HxCDF)",1E-8,1.3E-6,8.9999999999999996E-7,2.5999999999999998E-4,4.2E-7,2.5999999999999998E-4,"--"]
[null,"57117-44-9","1,2,3,6,7,8-Hexachlorodibenzofuran (HxCDF)",1E-8,1.3E-6,8.9999999999999996E-7,2.5999999999999998E-4,4.2E-7,2.5999999999999998E-4,"--"]
[null,"72918-21-9","1,2,3,7,8,9-Hexachlorodibenzofuran (HxCDF)",1E-8,1.3E-6,8.9999999999999996E-7,2.5999999999999998E-4,4.2E-7,2.5999999999999998E-4,"--"]
[null,"60851-34-5","2,3,4,6,7,8-Hexachlorodibenzofuran  (HxCDF)",1E-8,1.3E-6,8.9999999999999996E-7,2.5999999999999998E-4,4.2E-7,2.5999999999999998E-4,"--"]
[null,"67562-39-4","1,2,3,4,6,7,8-Heptachlorodibenzofuran (HpCDF)",9.9999999999999995E-8,1.2999999999999999E-5,9.0000000000000002E-6,2.5999999999999999E-3,4.1999999999999996E-6,2.5999999999999999E-3,"--"]
[null,"55673-89-7","1,2,3,4,7,8,9-Heptachlorodibenzofuran (HpCDF)",9.9999999999999995E-8,1.2999999999999999E-5,9.0000000000000002E-6,2.5999999999999999E-3,4.1999999999999996E-6,2.5999999999999999E-3,"--"]
[null,"39001-02-0","Octachlorodibenzofuran (OCDF)",3.4000000000000001E-6,4.2000000000000002E-4,2.9999999999999997E-4,8.5000000000000006E-2,1.3999999999999999E-4,8.5000000000000006E-2,"--"]
[null,"401","Polycyclic aromatic hydrocarbons (PAHs)",4.3000000000000002E-5,"--",1.6000000000000001E-3,"--",3.0000000000000001E-3,"--","--"]
[null,"191-26-4","Anthanthrene",1.1E-4,"--",3.8999999999999998E-3,"--",7.6E-3,"--","--"]
[null,"56-55-3","Benz[a]anthracene",2.1000000000000001E-4,"--",7.7999999999999996E-3,"--",1.4999999999999999E-2,"--","--"]
[null,"50-32-8","Benzo[a]pyrene",4.3000000000000002E-5,2E-3,1.6000000000000001E-3,8.8000000000000005E-3,3.0000000000000001E-3,8.8000000000000005E-3,2E-3]
[null,"205-99-2","Benzo[b]fluoranthene",5.3000000000000001E-5,"--",2E-3,"--",3.8E-3,"--","--"]
[null,"205-12-9","Benzo[c]fluorene",2.0999999999999998E-6,"--",7.7999999999999999E-5,"--",1.4999999999999999E-4,"--","--"]
[null,"191-24-2","Benzo[g,h,i]perylene",4.7000000000000002E-3,"--",0.17,"--",0.34,"--","--"]
[null,"205-82-3","Benzo[j]fluoranthene",1.3999999999999999E-4,"--",5.1999999999999998E-3,"--",0.01,"--","--"]
[null,"207-08-9","Benzo[k]fluoranthene",1.4E-3,"--",5.1999999999999998E-2,"--",0.1,"--","--"]
[null,"218-01-9","Chrysene",4.2999999999999999E-4,"--",1.6E-2,"--",0.03,"--","--"]
[null,"27208-37-3","Cyclopenta[c,d]pyrene",1.1E-4,"--",3.8999999999999998E-3,"--",7.6E-3,"--","--"]
[null,"53-70-3","Dibenz[a,h]anthracene",4.3000000000000003E-6,"--",1.6000000000000001E-4,"--",2.9999999999999997E-4,"--","--"]
[null,"192-65-4","Dibenzo[a,e]pyrene",1.1E-4,"--",3.8999999999999998E-3,"--",7.6E-3,"--","--"]
[null,"189-64-0","Dibenzo[a,h]pyrene",4.6999999999999997E-5,"--",1.6999999999999999E-3,"--",3.3999999999999998E-3,"--","--"]
[null,"189-55-9","Dibenzo[a,i]pyrene",7.1000000000000005E-5,"--",2.5999999999999999E-3,"--",5.1000000000000004E-3,"--","--"]
[null,"191-30-0","Dibenzo[a,l]pyrene",1.3999999999999999E-6,"--",5.1999999999999997E-5,"--",1E-4,"--","--"]
[null,"206-44-0","Fluoranthene",5.2999999999999998E-4,"--",0.02,"--",3.7999999999999999E-2,"--","--"]
[null,"193-39-5","Indeno[1,2,3-cd]pyrene",6.0999999999999997E-4,"--",2.1999999999999999E-2,"--",4.2999999999999997E-2,"--","--"]
[null,"3697-24-3","5-Methylchrysene",4.3000000000000002E-5,"--",1.6000000000000001E-3,"--",3.0000000000000001E-3,"--","--"]
[null,"7496-02-8","6-Nitrochrysene",4.3000000000000003E-6,"--",1.6000000000000001E-4,"--",2.9999999999999997E-4,"--","--"]
[null,"7758-01-2","Potassium bromate",7.1000000000000004E-3,"--",0.19,"--",8.5999999999999993E-2,"--","--"]
[null,"1120-71-4","1,3-Propane sultone",1.4E-3,"--",3.7999999999999999E-2,"--",1.7000000000000001E-2,"--","--"]
[null,"123-38-6","Propionaldehyde","--",8,"--",35,"--",35,"--"]
[null,"115-07-1","Propylene","--",3000,"--",13000,"--",13000,"--"]
[null,"6423-43-4","Propylene glycol dinitrate","--",0.27,"--",1.2,"--",1.2,20]
[null,"107-98-2","Propylene glycol monomethyl ether","--",7000,"--",31000,"--",31000,"--"]
[null,"75-56-9","Propylene oxide",0.27,30,7,130,3.2,130,3100]
[null,"572","Refractory Ceramic Fibers","--",0.03,"--",0.13,"--",0.13,"--"]
[null,"7783-07-5","Selenide, hydrogen","--","--","--","--","--","--",5]
[null,"7782-49-2","Selenium and compounds","--","--","--","--","--","--",2]
[null,"7631-86-9","Silica, crystalline (respirable)","--",3,"--",13,"--",13,"--"]
[null,"1310-73-2","Sodium hydroxide","--","--","--","--","--","--",8]
[null,"100-42-5","Styrene","--",1000,"--",4400,"--",4400,21000]
[null,"7664-93-9","Sulfuric acid","--",1,"--",4.4000000000000004,"--",4.4000000000000004,120]
[null,"505-60-2","Sulfur Mustard","--","--","--","--","--","--",0.7]
[null,"7446-71-9","Sulfur trioxide","--",1,"--",4.4000000000000004,"--",4.4000000000000004,120]
[null,"630-20-6","1,1,1,2-Tetrachloroethane",0.14000000000000001,"--",3.5,"--",1.6,"--","--"]
[null,"79-34-5","1,1,2,2-Tetrachloroethane",1.7000000000000001E-2,"--",0.45,"--",0.21,"--","--"]
[null,"127-18-4","Tetrachloroethene (Perchloroethylene)",3.8,41,100,180,46,180,41]
[null,"811-97-2","1,1,1,2-Tetrafluoroethane","--",80000,"--",350000,"--",350000,"--"]
[null,"62-55-5","Thioacetamide",5.9000000000000003E-4,"--",1.4999999999999999E-2,"--",7.1000000000000004E-3,"--","--"]
[null,"7550-45-0","Titanium tetrachloride","--",0.1,"--",0.44,"--",0.44,10]
[null,"108-88-3","Toluene","--",5000,"--",22000,"--",22000,7500]
[null,"26471-62-5","Toluene diisocyanates (2,4- and 2,6-)",9.0999999999999998E-2,2.1000000000000001E-2,2.4,9.1999999999999998E-2,1.1000000000000001,9.1999999999999998E-2,7.0999999999999994E-2]
[null,"8001-35-2","Toxaphene (Polychlorinated camphenes)",3.0999999999999999E-3,"--",8.1000000000000003E-2,"--",3.7999999999999999E-2,"--","--"]
[null,"71-55-6","1,1,1-Trichloroethane (Methyl chloroform)","--",5000,"--",22000,"--",22000,11000]
[null,"79-00-5","1,1,2-Trichloroethane (Vinyl trichloride)",6.3E-2,"--",1.6,"--",0.75,"--","--"]
[null,"79-01-6","Trichloroethene (TCE, Trichloroethylene)",0.2,2.1,3.5,9.1999999999999993,2.9,9.1999999999999993,2.1]
[null,"88-06-2","2,4,6-Trichlorophenol",0.05,"--",1.3,"--",0.6,"--","--"]
[null,"96-18-4","1,2,3-Trichloropropane","--",0.3,"--",1.3,"--",1.3,1.8]
[null,"121-44-8","Triethylamine","--",200,"--",880,"--",880,2800]
[null,"526-73-8","1,2,3-Trimethylbenzene","--",60,"--",260,"--",260,"--"]
[null,"95-63-6","1,2,4-Trimethylbenzene","--",60,"--",260,"--",260,"--"]
[null,"108-67-8","1,3,5-Trimethylbenzene","--",60,"--",260,"--",260,"--"]
[null,"51-79-6","Urethane (Ethyl carbamate)",2E-3,"--",2.1000000000000001E-2,"--",4.1000000000000002E-2,"--","--"]
[null,"7440-62-2","Vanadium (fume or dust)","--",0.1,"--",0.44,"--",0.44,0.8]
[null,"1314-62-1","Vanadium pentoxide",1.2E-4,7.0000000000000001E-3,3.0999999999999999E-3,3.1E-2,1.4E-3,3.1E-2,30]
[null,"108-05-4","Vinyl acetate","--",200,"--",880,"--",880,200]
[null,"593-60-2","Vinyl bromide","--",3,"--",13,"--",13,"--"]
[null,"75-01-4","Vinyl chloride",0.11,100,0.22,440,2.7,440,1300]
[null,"75-35-4","Vinylidene chloride","--",200,"--",880,"--",880,200]
[null,"1330-20-7","Xylene (mixture), including m-xylene, o-xylene, p-xylene","--",220,"--",970,"--",970,8700]

{"sheet":"TACs","index":7,"n_rows":610,"n_cols":4,"rows_kept":610,"cut":false,"hidden":false,"merged":[]}
[]
[null,"Chemical","CAS#","RBC?"]
[null,"Acetaldehyde","75-07-0"]
[null,"Acetamide","60-35-5"]
[null,"Acetone","67-64-1"]
[null,"Acetonitrile","75-05-8"]
[null,"Acetophenone","98-86-2",{"$f":"IFERROR(VLOOKUP(C7,RBCs!$B$5:$C$265,2,FALSE),\"NoRBC\")","v":"NoRBC"}]
[null,"Acrolein","107-02-8"]
[null,"Acrylamide","79-06-1"]
[null,"Acrylic acid","79-10-7"]
[null,"Acrylonitrile","107-13-1"]
[null,"Actinomycin D","50-76-0",{"$f":"IFERROR(VLOOKUP(C12,RBCs!$B$5:$C$265,2,FALSE),\"NoRBC\")","v":"NoRBC"}]
[null,"Alar","1596-84-5",{"$f":"IFERROR(VLOOKUP(C13,RBCs!$B$5:$C$265,2,FALSE),\"NoRBC\")","v":"NoRBC"}]
[null,"Aldrin","309-00-2"]
[null,"Allyl chloride","107-05-1"]
[null,"Aluminum and compounds","7429-90-5"]
[null,"Aluminum oxide (fibrous forms)","1344-28-1",{"$f":"IFERROR(VLOOKUP(C17,RBCs!$B$5:$C$265,2,FALSE),\"NoRBC\")","v":"NoRBC"}]
[null,"ortho-Aminoazotoluene","97-56-3",{"$f":"IFERROR(VLOOKUP(C18,RBCs!$B$5:$C$265,2,FALSE),\"NoRBC\")","v":"NoRBC"}]
[null,"3-Amino-9-ethylcarbazole hydrochloride","6109-97-3",{"$f":"IFERROR(VLOOKUP(C19,RBCs!$B$5:$C$265,2,FALSE),\"NoRBC\")","v":"NoRBC"}]
[null,"2-Amino-3-methyl-9H pyrido[2,3-b]indole","68006-83-7",{"$f":"IFERROR(VLOOKUP(C20,RBCs!$B$5:$C$265,2,FALSE),\"NoRBC\")","v":"NoRBC"}]
[null,"1-Amino-2-methylanthraquinone","82-28-0",{"$f":"IFERROR(VLOOKUP(C21,RBCs!$B$5:$C$265,2,FALSE),\"NoRBC\")","v":"NoRBC"}]
[null,"2-Amino-3-methylimidazo-[4,5-f]quinoline","76180-96-6",{"$f":"IFERROR(VLOOKUP(C22,RBCs!$B$5:$C$265,2,FALSE),\"NoRBC\")","v":"NoRBC"}]
[null,"2-Amino-5-(5-Nitro-2-Furyl)-1,3,4-Thiadiazol","712-68-5",{"$f":"IFERROR(VLOOKUP(C23,RBCs!$B$5:$C$265,2,FALSE),\"NoRBC\")","v":"NoRBC"}]
[null,"A-alpha-c(2-amino-9h-pyrido[2,3-b]indole)","26148-68-5",{"$f":"IFERROR(VLOOKUP(C24,RBCs!$B$5:$C$265,2,FALSE),\"NoRBC\")","v":"NoRBC"}]
[null,"4-Aminobiphenyl","92-67-1",{"$f":"IFERROR(VLOOKUP(C25,RBCs!$B$5:$C$265,2,FALSE),\"NoRBC\")","v":"NoRBC"}]
[null,"Amitrole","61-82-5",{"$f":"IFERROR(VLOOKUP(C26,RBCs!$B$5:$C$265,2,FALSE),\"NoRBC\")","v":"NoRBC"}]
[null,"Ammonia","7664-41-7"]
[null,"Ammonium bisulfate","7803-63-6",{"$f":"IFERROR(VLOOKUP(C28,RBCs!$B$5:$C$265,2,FALSE),\"NoRBC\")","v":"NoRBC"}]
[null,"Ammonium nitrate","6484-52-2",{"$f":"IFERROR(VLOOKUP(C29,RBCs!$B$5:$C$265,2,FALSE),\"NoRBC\")","v":"NoRBC"}]
[null,"Ammonium sulfate","7783-20-2",{"$f":"IFERROR(VLOOKUP(C30,RBCs!$B$5:$C$265,2,FALSE),\"NoRBC\")","v":"NoRBC"}]
[null,"Aniline","62-53-3"]
[null,"o-Anisidine","90-04-0",{"$f":"IFERROR(VLOOKUP(C32,RBCs!$B$5:$C$265,2,FALSE),\"NoRBC\")","v":"NoRBC"}]
[null,"o-Anisidine hydrochloride","134-29-2",{"$f":"IFERROR(VLOOKUP(C33,RBCs!$B$5:$C$265,2,FALSE),\"NoRBC\")","v":"NoRBC"}]
[null,"Antimony and compounds","7440-36-0"]
[null,"Antimony trioxide","1309-64-4",{"$f":"IFERROR(VLOOKUP(C35,RBCs!$B$5:$C$265,2,FALSE),\"NoRBC\")","v":"NoRBC"}]
[null,"Aramite","140-57-8"]
[null,"Arsenic and compounds","7440-38-2"]
[null,"Arsine","7784-42-1"]
[null,"Asbestos","1332-21-4"]
[null,"Auramine","492-80-8",{"$f":"IFERROR(VLOOKUP(C40,RBCs!$B$5:$C$265,2,FALSE),\"NoRBC\")","v":"NoRBC"}]
[null,"Azaserine","115-02-6",{"$f":"IFERROR(VLOOKUP(C41,RBCs!$B$5:$C$265,2,FALSE),\"NoRBC\")","v":"NoRBC"}]
[null,"Azathioprine","446-86-6",{"$f":"IFERROR(VLOOKUP(C42,RBCs!$B$5:$C$265,2,FALSE),\"NoRBC\")","v":"NoRBC"}]
[null,"Tris-(1-Aziridinyl)phosphine sulfide","52-24-4",{"$f":"IFERROR(VLOOKUP(C43,RBCs!$B$5:$C$265,2,FALSE),\"NoRBC\")","v":"NoRBC"}]
[null,"Azobenzene","103-33-3"]
[null,"Barium and compounds","7440-39-3",{"$f":"IFERROR(VLOOKUP(C45,RBCs!$B$5:$C$265,2,FALSE),\"NoRBC\")","v":"NoRBC"}]
[null,"Benzene","71-43-2"]
[null,"Benzidine (and its salts)","92-87-5"]
[null,"Benzofuran","271-89-6",{"$f":"IFERROR(VLOOKUP(C48,RBCs!$B$5:$C$265,2,FALSE),\"NoRBC\")","v":"NoRBC"}]
[null,"Benzoic trichloride (Benzotrichloride)","98-07-7",{"$f":"IFERROR(VLOOKUP(C49,RBCs!$B$5:$C$265,2,FALSE),\"NoRBC\")","v":"NoRBC"}]
[null,"Benzoyl chloride","98-88-4",{"$f":"IFERROR(VLOOKUP(C50,RBCs!$B$5:$C$265,2,FALSE),\"NoRBC\")","v":"NoRBC"}]
[null,"Benzoyl peroxide","94-36-0",{"$f":"IFERROR(VLOOKUP(C51,RBCs!$B$5:$C$265,2,FALSE),\"NoRBC\")","v":"NoRBC"}]
[null,"Benzyl chloride","100-44-7"]
[null,"Benzyl Violet 4B","1694-09-3",{"$f":"IFERROR(VLOOKUP(C53,RBCs!$B$5:$C$265,2,FALSE),\"NoRBC\")","v":"NoRBC"}]
[null,"Beryllium and compounds","7440-41-7"]
[null,"Beryllium Oxide","1304-56-9",{"$f":"IFERROR(VLOOKUP(C55,RBCs!$B$5:$C$265,2,FALSE),\"NoRBC\")","v":"NoRBC"}]
[null,"Beryllium Sulfate","13510-49-1",{"$f":"IFERROR(VLOOKUP(C56,RBCs!$B$5:$C$265,2,FALSE),\"NoRBC\")","v":"NoRBC"}]
[null,"Biphenyl","92-52-4",{"$f":"IFERROR(VLOOKUP(C57,RBCs!$B$5:$C$265,2,FALSE),\"NoRBC\")","v":"NoRBC"}]
[null,"Bis(2-chloroethyl) ether (DCEE)","111-44-4"]
[null,"Bis(chloromethyl) ether","542-88-1"]
[null,"Bis(2-ethylhexyl) adipate","103-23-1",{"$f":"IFERROR(VLOOKUP(C60,RBCs!$B$5:$C$265,2,FALSE),\"NoRBC\")","v":"NoRBC"}]
[null,"Bis(2-ethylhexyl) phthalate (DEHP)","117-81-7"]
[null,"Bromine and compounds","7726-95-6",{"$f":"IFERROR(VLOOKUP(C62,RBCs!$B$5:$C$265,2,FALSE),\"NoRBC\")","v":"NoRBC"}]
[null,"Bromine pentafluoride","7789-30-2",{"$f":"IFERROR(VLOOKUP(C63,RBCs!$B$5:$C$265,2,FALSE),\"NoRBC\")","v":"NoRBC"}]
[null,"Bromodichloromethane","75-27-4",{"$f":"IFERROR(VLOOKUP(C64,RBCs!$B$5:$C$265,2,FALSE),\"NoRBC\")","v":"NoRBC"}]
[null,"Bromoform","75-25-2"]
[null,"Bromomethane (Methyl bromide)","74-83-9"]
[null,"1-Bromopropane (n-propyl bromide)","106-94-5"]
[null,"Tris(2,3-dibromopropyl)phosphate","126-72-7",{"$f":"IFERROR(VLOOKUP(C68,RBCs!$B$5:$C$265,2,FALSE),\"NoRBC\")","v":"NoRBC"}]
[null,"1,3-Butadiene","106-99-0"]
[null,"2-Butanone (Methyl ethyl ketone)","78-93-3"]
[null,"t-Butyl acetate","540-88-5",{"$f":"IFERROR(VLOOKUP(C71,RBCs!$B$5:$C$265,2,FALSE),\"NoRBC\")","v":"NoRBC"}]
[null,"Butyl acrylate","141-32-2",{"$f":"IFERROR(VLOOKUP(C72,RBCs!$B$5:$C$265,2,FALSE),\"NoRBC\")","v":"NoRBC"}]
[null,"n-Butyl alcohol","71-36-3",{"$f":"IFERROR(VLOOKUP(C73,RBCs!$B$5:$C$265,2,FALSE),\"NoRBC\")","v":"NoRBC"}]
[null,"sec-Butyl alcohol","78-92-2"]
[null,"tert-Butyl alcohol","75-65-0",{"$f":"IFERROR(VLOOKUP(C75,RBCs!$B$5:$C$265,2,FALSE),\"NoRBC\")","v":"NoRBC"}]
[null,"Butyl benzyl phthalate","85-68-7",{"$f":"IFERROR(VLOOKUP(C76,RBCs!$B$5:$C$265,2,FALSE),\"NoRBC\")","v":"NoRBC"}]
[null,"Butylated hydroxyanisole","25013-16-5",{"$f":"IFERROR(VLOOKUP(C77,RBCs!$B$5:$C$265,2,FALSE),\"NoRBC\")","v":"NoRBC"}]
[null,"beta-Butyrolactone","3068-88-0",{"$f":"IFERROR(VLOOKUP(C78,RBCs!$B$5:$C$265,2,FALSE),\"NoRBC\")","v":"NoRBC"}]
[null,"Cadmium and compounds","7440-43-9"]
[null,"Calcium cyanamide","156-62-7",{"$f":"IFERROR(VLOOKUP(C80,RBCs!$B$5:$C$265,2,FALSE),\"NoRBC\")","v":"NoRBC"}]
[null,"Caprolactam","105-60-2"]
[null,"Captafol","2425-06-1",{"$f":"IFERROR(VLOOKUP(C82,RBCs!$B$5:$C$265,2,FALSE),\"NoRBC\")","v":"NoRBC"}]
[null,"Captan","133-06-2",{"$f":"IFERROR(VLOOKUP(C83,RBCs!$B$5:$C$265,2,FALSE),\"NoRBC\")","v":"NoRBC"}]
[null,"Carbon black extracts","89",{"$f":"IFERROR(VLOOKUP(C84,RBCs!$B$5:$C$265,2,FALSE),\"NoRBC\")","v":"NoRBC"}]
[null,"Carbon disulfide","75-15-0"]
[null,"Carbon tetrachloride","56-23-5"]
[null,"Carbonyl sulfide","463-58-1"]
[null,"Carrageenan (degraded)","9000-07-1",{"$f":"IFERROR(VLOOKUP(C88,RBCs!$B$5:$C$265,2,FALSE),\"NoRBC\")","v":"NoRBC"}]
[null,"Catechol","120-80-9",{"$f":"IFERROR(VLOOKUP(C89,RBCs!$B$5:$C$265,2,FALSE),\"NoRBC\")","v":"NoRBC"}]
[null,"Ceramic fibers","351",{"$f":"IFERROR(VLOOKUP(C90,RBCs!$B$5:$C$265,2,FALSE),\"NoRBC\")","v":"NoRBC"}]
[null,"Chloramben","133-90-4",{"$f":"IFERROR(VLOOKUP(C91,RBCs!$B$5:$C$265,2,FALSE),\"NoRBC\")","v":"NoRBC"}]
[null,"Chlorambucil","305-03-3",{"$f":"IFERROR(VLOOKUP(C92,RBCs!$B$5:$C$265,2,FALSE),\"NoRBC\")","v":"NoRBC"}]
[null,"Chlordane","57-74-9"]
[null,"Chlordecone","143-50-0",{"$f":"IFERROR(VLOOKUP(C94,RBCs!$B$5:$C$265,2,FALSE),\"NoRBC\")","v":"NoRBC"}]
[null,"Chlorendic Acid","115-28-6",{"$f":"IFERROR(VLOOKUP(C95,RBCs!$B$5:$C$265,2,FALSE),\"NoRBC\")","v":"NoRBC"}]
[null,"Chlorinated fluorocarbon (1,1,2-Trichloro-1,2,2-trifluoroethane, CFC-113)","76-13-1",{"$f":"IFERROR(VLOOKUP(C96,RBCs!$B$5:$C$265,2,FALSE),\"NoRBC\")","v":"NoRBC"}]
[null,"Chlorinated paraffins","108171-26-2"]
[null,"Chlorine","7782-50-5"]
[null,"Chlorine dioxide","10049-04-4"]
[null,"Chloroacetic acid","79-11-8",{"$f":"IFERROR(VLOOKUP(C100,RBCs!$B$5:$C$265,2,FALSE),\"NoRBC\")","v":"NoRBC"}]
[null,"2-Chloroacetophenone","532-27-4"]
[null,"Chloroalkanes C10-13 (Chlorinated paraffins)","85535-84-8",{"$f":"IFERROR(VLOOKUP(C102,RBCs!$B$5:$C$265,2,FALSE),\"NoRBC\")","v":"NoRBC"}]
[null,"p-Chloroaniline","106-47-8",{"$f":"IFERROR(VLOOKUP(C103,RBCs!$B$5:$C$265,2,FALSE),\"NoRBC\")","v":"NoRBC"}]
[null,"Chlorobenzene","108-90-7"]
[null,"Chlorobenzilate (Ethyl-4,4'-dichlorobenzilate)","510-15-6",{"$f":"IFERROR(VLOOKUP(C105,RBCs!$B$5:$C$265,2,FALSE),\"NoRBC\")","v":"NoRBC"}]
[null,"1-Chloro-1,1-difluoroethane","75-68-3"]
[null,"Chlorodifluoromethane (Freon 22)","75-45-6"]
[null,"Chloroethane (Ethyl chloride)","75-00-3"]
[null,"Chloroform","67-66-3"]
[null,"Chloromethane (Methyl chloride)","74-87-3"]
[null,"Chloromethyl methyl ether (technical grade)","107-30-2",{"$f":"IFERROR(VLOOKUP(C111,RBCs!$B$5:$C$265,2,FALSE),\"NoRBC\")","v":"NoRBC"}]
[null,"3-Chloro-2-methyl-1-propene","563-47-3",{"$f":"IFERROR(VLOOKUP(C112,RBCs!$B$5:$C$265,2,FALSE),\"NoRBC\")","v":"NoRBC"}]
[null,"2-Chlorophenol","95-57-8",{"$f":"IFERROR(VLOOKUP(C113,RBCs!$B$5:$C$265,2,FALSE),\"NoRBC\")","v":"NoRBC"}]
[null,"4-Chloro-o-phenylenediamine","95-83-0"]
[null,"Chloropicrin","76-06-2"]
[null,"Chloroprene","126-99-8"]
[null,"Chlorothalonil","1897-45-6",{"$f":"IFERROR(VLOOKUP(C117,RBCs!$B$5:$C$265,2,FALSE),\"NoRBC\")","v":"NoRBC"}]
[null,"p-Chloro-o-toluidine","95-69-2"]
[null,"Chlorozotocin","54749-90-5",{"$f":"IFERROR(VLOOKUP(C119,RBCs!$B$5:$C$265,2,FALSE),\"NoRBC\")","v":"NoRBC"}]
[null,"Chromic(VI) Acid","7738-94-5"]
[null,"Chromium VI, chromate, and dichromate particulate","18540-29-9"]
[null,"Chromium trioxide","1333-82-0",{"$f":"IFERROR(VLOOKUP(C122,RBCs!$B$5:$C$265,2,FALSE),\"NoRBC\")","v":"NoRBC"}]
[null,"C.I. Basic Red 9 Monohydrochloride","569-61-9",{"$f":"IFERROR(VLOOKUP(C123,RBCs!$B$5:$C$265,2,FALSE),\"NoRBC\")","v":"NoRBC"}]
[null,"Cinnamyl anthranilate","87-29-6",{"$f":"IFERROR(VLOOKUP(C124,RBCs!$B$5:$C$265,2,FALSE),\"NoRBC\")","v":"NoRBC"}]
[null,"Cobalt and compounds","7440-48-4"]
[null,"Coke Oven Emissions","148"]
[null,"Copper and compounds","7440-50-8"]
[null,"Creosotes","150",{"$f":"IFERROR(VLOOKUP(C128,RBCs!$B$5:$C$265,2,FALSE),\"NoRBC\")","v":"NoRBC"}]
[null,"p-Cresidine","120-71-8"]
[null,"Cresols (mixture), including m-cresol, o-cresol, p-cresol","1319-77-3"]
[null,"m-Cresol","108-39-4",{"$f":"IFERROR(VLOOKUP(C131,RBCs!$B$5:$C$265,2,FALSE),\"NoRBC\")","v":"NoRBC"}]
[null,"o-Cresol","95-48-7",{"$f":"IFERROR(VLOOKUP(C132,RBCs!$B$5:$C$265,2,FALSE),\"NoRBC\")","v":"NoRBC"}]
[null,"p-Cresol","106-44-5",{"$f":"IFERROR(VLOOKUP(C133,RBCs!$B$5:$C$265,2,FALSE),\"NoRBC\")","v":"NoRBC"}]
[null,"Crotonaldehyde","4170-30-3",{"$f":"IFERROR(VLOOKUP(C134,RBCs!$B$5:$C$265,2,FALSE),\"NoRBC\")","v":"NoRBC"}]
[null,"Cumene hydroperoxide","80-15-9",{"$f":"IFERROR(VLOOKUP(C135,RBCs!$B$5:$C$265,2,FALSE),\"NoRBC\")","v":"NoRBC"}]
[null,"Cupferron","135-20-6"]
[null,"Cyanide compounds","57-12-5",{"$f":"IFERROR(VLOOKUP(C137,RBCs!$B$5:$C$265,2,FALSE),\"NoRBC\")","v":"NoRBC"}]
[null,"Cyanide, hydrogen","74-90-8"]
[null,"Cyclohexane","110-82-7"]
[null,"Cyclohexanol","108-93-0",{"$f":"IFERROR(VLOOKUP(C140,RBCs!$B$5:$C$265,2,FALSE),\"NoRBC\")","v":"NoRBC"}]
[null,"Cycloheximide","66-81-9",{"$f":"IFERROR(VLOOKUP(C141,RBCs!$B$5:$C$265,2,FALSE),\"NoRBC\")","v":"NoRBC"}]
[null,"Cyclophosphamide (anhydrous)","50-18-0",{"$f":"IFERROR(VLOOKUP(C142,RBCs!$B$5:$C$265,2,FALSE),\"NoRBC\")","v":"NoRBC"}]
[null,"Cyclophosphamide (hydrated)","6055-19-2",{"$f":"IFERROR(VLOOKUP(C143,RBCs!$B$5:$C$265,2,FALSE),\"NoRBC\")","v":"NoRBC"}]
[null,"D & C Red No. 9","5160-02-1",{"$f":"IFERROR(VLOOKUP(C144,RBCs!$B$5:$C$265,2,FALSE),\"NoRBC\")","v":"NoRBC"}]
[null,"Dacarbazine","4342-03-4",{"$f":"IFERROR(VLOOKUP(C145,RBCs!$B$5:$C$265,2,FALSE),\"NoRBC\")","v":"NoRBC"}]
[null,"Dantron","117-10-2",{"$f":"IFERROR(VLOOKUP(C146,RBCs!$B$5:$C$265,2,FALSE),\"NoRBC\")","v":"NoRBC"}]
[null,"4,4'-DDD (4,4'-dichlorodiphenyldichloroethane)","72-54-8",{"$f":"IFERROR(VLOOKUP(C147,RBCs!$B$5:$C$265,2,FALSE),\"NoRBC\")","v":"NoRBC"}]
[null,"2,4'-DDD (2,4'-dichlorodiphenyldichloroethane)","53-19-0",{"$f":"IFERROR(VLOOKUP(C148,RBCs!$B$5:$C$265,2,FALSE),\"NoRBC\")","v":"NoRBC"}]
[null,"DDE (1-chloro-4-[1-(4-chlorophenyl)ethyl]benzene)","3547-04-4",{"$f":"IFERROR(VLOOKUP(C149,RBCs!$B$5:$C$265,2,FALSE),\"NoRBC\")","v":"NoRBC"}]
[null,"2,4'-DDE (2,4'-dichlorodiphenyldichloroethene)","3424-82-6",{"$f":"IFERROR(VLOOKUP(C150,RBCs!$B$5:$C$265,2,FALSE),\"NoRBC\")","v":"NoRBC"}]
[null,"4,4'-DDE (4,4'-dichlorodiphenyldichloroethene)","72-55-9",{"$f":"IFERROR(VLOOKUP(C151,RBCs!$B$5:$C$265,2,FALSE),\"NoRBC\")","v":"NoRBC"}]
[null,"2,4'-DDT (2,4'-dichlorodiphenyltrichloroethane)","789-02-6",{"$f":"IFERROR(VLOOKUP(C152,RBCs!$B$5:$C$265,2,FALSE),\"NoRBC\")","v":"NoRBC"}]
[null,"DDT","50-29-3"]
[null,"2,4-Diaminoanisole","615-05-4"]
[null,"2,4-Diaminoanisole sulfate","39156-41-7",{"$f":"IFERROR(VLOOKUP(C155,RBCs!$B$5:$C$265,2,FALSE),\"NoRBC\")","v":"NoRBC"}]
[null,"4,4'-Diaminodiphenyl ether","101-80-4",{"$f":"IFERROR(VLOOKUP(C156,RBCs!$B$5:$C$265,2,FALSE),\"NoRBC\")","v":"NoRBC"}]
[null,"2,4-Diaminotoluene (2,4-Toluene diamine)","95-80-7"]
[null,"Diazomethane","334-88-3",{"$f":"IFERROR(VLOOKUP(C158,RBCs!$B$5:$C$265,2,FALSE),\"NoRBC\")","v":"NoRBC"}]
[null,"Diazinon","333-41-5"]
[null,"Dibenzofuran","132-64-9",{"$f":"IFERROR(VLOOKUP(C160,RBCs!$B$5:$C$265,2,FALSE),\"NoRBC\")","v":"NoRBC"}]
[null,"Dibromochloromethane","124-48-1",{"$f":"IFERROR(VLOOKUP(C161,RBCs!$B$5:$C$265,2,FALSE),\"NoRBC\")","v":"NoRBC"}]
[null,"1,2-Dibromo-3-chloropropane (DBCP)","96-12-8"]
[null,"2,3-Dibromo-1-propanol","96-13-9",{"$f":"IFERROR(VLOOKUP(C163,RBCs!$B$5:$C$265,2,FALSE),\"NoRBC\")","v":"NoRBC"}]
[null,"Dibutyl phthalate","84-74-2",{"$f":"IFERROR(VLOOKUP(C164,RBCs!$B$5:$C$265,2,FALSE),\"NoRBC\")","v":"NoRBC"}]
[null,"1,2-Dichlorobenzene","95-50-1",{"$f":"IFERROR(VLOOKUP(C165,RBCs!$B$5:$C$265,2,FALSE),\"NoRBC\")","v":"NoRBC"}]
[null,"1,3-Dichlorobenzene","541-73-1",{"$f":"IFERROR(VLOOKUP(C166,RBCs!$B$5:$C$265,2,FALSE),\"NoRBC\")","v":"NoRBC"}]
[null,"p-Dichlorobenzene (1,4-Dichlorobenzene)","106-46-7"]
[null,"3,3'-Dichlorobenzidine","91-94-1"]
[null,"Dichlorodifluoromethane (Freon 12)","75-71-8",{"$f":"IFERROR(VLOOKUP(C169,RBCs!$B$5:$C$265,2,FALSE),\"NoRBC\")","v":"NoRBC"}]
[null,"Dichlorofluoromethane (Freon 21)","75-43-4",{"$f":"IFERROR(VLOOKUP(C170,RBCs!$B$5:$C$265,2,FALSE),\"NoRBC\")","v":"NoRBC"}]
[null,"1,1-Dichloroethane (Ethylidene dichloride)","75-34-3"]
[null,"trans-1,2-dichloroethene","156-60-5"]
[null,"Dichloromethane (Methylene chloride)","75-09-2"]
[null,"2,4-Dichlorophenol","120-83-2",{"$f":"IFERROR(VLOOKUP(C174,RBCs!$B$5:$C$265,2,FALSE),\"NoRBC\")","v":"NoRBC"}]
[null,"Dichlorophenoxyacetic acid, salts and esters (2,4-D)","94-75-7",{"$f":"IFERROR(VLOOKUP(C175,RBCs!$B$5:$C$265,2,FALSE),\"NoRBC\")","v":"NoRBC"}]
[null,"1,2-Dichloropropane (Propylene dichloride)","78-87-5"]
[null,"1,3-Dichloropropene","542-75-6"]
[null,"Dichlorovos (DDVP)","62-73-7"]
[null,"Dicofol","115-32-2",{"$f":"IFERROR(VLOOKUP(C179,RBCs!$B$5:$C$265,2,FALSE),\"NoRBC\")","v":"NoRBC"}]
[null,"Di-cyclohexyl phthalate (DCHP)","84-61-7",{"$f":"IFERROR(VLOOKUP(C180,RBCs!$B$5:$C$265,2,FALSE),\"NoRBC\")","v":"NoRBC"}]
[null,"Dieldrin","60-57-1"]
[null,"Diesel Particulate Matter","200"]
[null,"Diethanolamine","111-42-2"]
[null,"Diethylene glycol","111-46-6",{"$f":"IFERROR(VLOOKUP(C184,RBCs!$B$5:$C$265,2,FALSE),\"NoRBC\")","v":"NoRBC"}]
[null,"Diethylene glycol dimethyl ether","111-96-6",{"$f":"IFERROR(VLOOKUP(C185,RBCs!$B$5:$C$265,2,FALSE),\"NoRBC\")","v":"NoRBC"}]
[null,"Diethylene glycol monobutyl ether","112-34-5"]
[null,"Diethylene glycol monoethyl ether","111-90-0"]
[null,"Diethylene glycol monomethyl ether","111-77-3",{"$f":"IFERROR(VLOOKUP(C188,RBCs!$B$5:$C$265,2,FALSE),\"NoRBC\")","v":"NoRBC"}]
[null,"Diethylphthalate","84-66-2",{"$f":"IFERROR(VLOOKUP(C189,RBCs!$B$5:$C$265,2,FALSE),\"NoRBC\")","v":"NoRBC"}]
[null,"Diethyl sulfate","64-67-5",{"$f":"IFERROR(VLOOKUP(C190,RBCs!$B$5:$C$265,2,FALSE),\"NoRBC\")","v":"NoRBC"}]
[null,"Diethyltoluamide, N,N- (DEET)","134-62-3",{"$f":"IFERROR(VLOOKUP(C191,RBCs!$B$5:$C$265,2,FALSE),\"NoRBC\")","v":"NoRBC"}]
[null,"1,1-Difluoroethane","75-37-6"]
[null,"Diglycidyl resorcinol ether","101-90-6",{"$f":"IFERROR(VLOOKUP(C193,RBCs!$B$5:$C$265,2,FALSE),\"NoRBC\")","v":"NoRBC"}]
[null,"Dihydrosafrole","94-58-6",{"$f":"IFERROR(VLOOKUP(C194,RBCs!$B$5:$C$265,2,FALSE),\"NoRBC\")","v":"NoRBC"}]
[null,"3,3'-Dimethoxybenzidine","119-90-4",{"$f":"IFERROR(VLOOKUP(C195,RBCs!$B$5:$C$265,2,FALSE),\"NoRBC\")","v":"NoRBC"}]
[null,"4-Dimethylaminoazobenzene","60-11-7"]
[null,"N,N-Dimethylaniline","121-69-7",{"$f":"IFERROR(VLOOKUP(C197,RBCs!$B$5:$C$265,2,FALSE),\"NoRBC\")","v":"NoRBC"}]
[null,"3,3'-Dimethylbenzidine (o-Tolidine)","119-93-7",{"$f":"IFERROR(VLOOKUP(C198,RBCs!$B$5:$C$265,2,FALSE),\"NoRBC\")","v":"NoRBC"}]
[null,"Dimethyl carbamoyl chloride","79-44-7",{"$f":"IFERROR(VLOOKUP(C199,RBCs!$B$5:$C$265,2,FALSE),\"NoRBC\")","v":"NoRBC"}]
[null,"Dimethyl formamide","68-12-2"]
[null,"1,1-Dimethylhydrazine","57-14-7"]
[null,"Dimethyl phthalate","131-11-3",{"$f":"IFERROR(VLOOKUP(C202,RBCs!$B$5:$C$265,2,FALSE),\"NoRBC\")","v":"NoRBC"}]
[null,"Dimethyl sulfate","77-78-1",{"$f":"IFERROR(VLOOKUP(C203,RBCs!$B$5:$C$265,2,FALSE),\"NoRBC\")","v":"NoRBC"}]
[null,"Dimethylvinylchloride","513-37-1",{"$f":"IFERROR(VLOOKUP(C204,RBCs!$B$5:$C$265,2,FALSE),\"NoRBC\")","v":"NoRBC"}]
[null,"4,6-Dinitro-o-cresol (and salts)","534-52-1",{"$f":"IFERROR(VLOOKUP(C205,RBCs!$B$5:$C$265,2,FALSE),\"NoRBC\")","v":"NoRBC"}]
[null,"2,4-Dinitrophenol","51-28-5",{"$f":"IFERROR(VLOOKUP(C206,RBCs!$B$5:$C$265,2,FALSE),\"NoRBC\")","v":"NoRBC"}]
[null,"2,4-Dinitrotoluene","121-14-2"]
[null,"2,6-Dinitrotoluene","606-20-2",{"$f":"IFERROR(VLOOKUP(C208,RBCs!$B$5:$C$265,2,FALSE),\"NoRBC\")","v":"NoRBC"}]
[null,"1,4-Dioxane","123-91-1"]
[null,"Diphenylhydantoin","630-93-3",{"$f":"IFERROR(VLOOKUP(C210,RBCs!$B$5:$C$265,2,FALSE),\"NoRBC\")","v":"NoRBC"}]
[null,"1,2-Diphenylhydrazine (Hydrazobenzene)","122-66-7"]
[null,"Dipropylene glycol","25265-71-8",{"$f":"IFERROR(VLOOKUP(C212,RBCs!$B$5:$C$265,2,FALSE),\"NoRBC\")","v":"NoRBC"}]
[null,"Dipropylene glycol monomethyl ether","34590-94-8",{"$f":"IFERROR(VLOOKUP(C213,RBCs!$B$5:$C$265,2,FALSE),\"NoRBC\")","v":"NoRBC"}]
[null,"Direct Black 38","1937-37-7"]
[null,"Direct Blue 6","2602-46-2"]
[null,"Direct Brown 95 (technical grade)","16071-86-6"]
[null,"Disperse Blue 1","2475-45-8",{"$f":"IFERROR(VLOOKUP(C217,RBCs!$B$5:$C$265,2,FALSE),\"NoRBC\")","v":"NoRBC"}]
[null,"Disulfoton","298-04-4"]
[null,"Epichlorohydrin","106-89-8"]
[null,"1,2-Epoxybutane","106-88-7"]
[null,"Epoxy resins","227",{"$f":"IFERROR(VLOOKUP(C221,RBCs!$B$5:$C$265,2,FALSE),\"NoRBC\")","v":"NoRBC"}]
[null,"Erionite","12510-42-8",{"$f":"IFERROR(VLOOKUP(C222,RBCs!$B$5:$C$265,2,FALSE),\"NoRBC\")","v":"NoRBC"}]
[null,"Ethyl acrylate","140-88-5"]
[null,"Ethyl benzene","100-41-4"]
[null,"Ethylene","74-85-1",{"$f":"IFERROR(VLOOKUP(C225,RBCs!$B$5:$C$265,2,FALSE),\"NoRBC\")","v":"NoRBC"}]
[null,"Ethylene dibromide (EDB, 1,2-Dibromoethane)","106-93-4"]
[null,"Ethylene dichloride (EDC, 1,2-Dichloroethane)","107-06-2"]
[null,"Ethylene glycol","107-21-1"]
[null,"Ethylene glycol diethyl ether","629-14-1",{"$f":"IFERROR(VLOOKUP(C229,RBCs!$B$5:$C$265,2,FALSE),\"NoRBC\")","v":"NoRBC"}]
[null,"Ethylene glycol dimethyl ether","110-71-4",{"$f":"IFERROR(VLOOKUP(C230,RBCs!$B$5:$C$265,2,FALSE),\"NoRBC\")","v":"NoRBC"}]
[null,"Ethylene glycol monobutyl ether","111-76-2"]
[null,"Ethylene glycol monoethyl ether","110-80-5"]
[null,"Ethylene glycol monoethyl ether acetate","111-15-9"]
[null,"Ethylene glycol monomethyl ether","109-86-4"]
[null,"Ethylene glycol monomethyl ether acetate","110-49-6"]
[null,"Ethylene glycol monopropyl ether","2807-30-9",{"$f":"IFERROR(VLOOKUP(C236,RBCs!$B$5:$C$265,2,FALSE),\"NoRBC\")","v":"NoRBC"}]
[null,"Ethyleneimine (Aziridine)","151-56-4",{"$f":"IFERROR(VLOOKUP(C237,RBCs!$B$5:$C$265,2,FALSE),\"NoRBC\")","v":"NoRBC"}]
[null,"Ethylene oxide","75-21-8"]
[null,"Ethylene thiourea","96-45-7"]
[null,"Ferric Sulfate","10028-22-5",{"$f":"IFERROR(VLOOKUP(C240,RBCs!$B$5:$C$265,2,FALSE),\"NoRBC\")","v":"NoRBC"}]
[null,"Fluorides","239"]
[null,"Fluorine gas","7782-41-4"]
[null,"Formaldehyde","50-00-0"]
[null,"Furan","110-00-9",{"$f":"IFERROR(VLOOKUP(C244,RBCs!$B$5:$C$265,2,FALSE),\"NoRBC\")","v":"NoRBC"}]
[null,"Furmecyclox","60568-05-0",{"$f":"IFERROR(VLOOKUP(C245,RBCs!$B$5:$C$265,2,FALSE),\"NoRBC\")","v":"NoRBC"}]
[null,"Furylfuramide","3688-53-7",{"$f":"IFERROR(VLOOKUP(C246,RBCs!$B$5:$C$265,2,FALSE),\"NoRBC\")","v":"NoRBC"}]
[null,"Glasswool fibers","352",{"$f":"IFERROR(VLOOKUP(C247,RBCs!$B$5:$C$265,2,FALSE),\"NoRBC\")","v":"NoRBC"}]
[null,"Glutaraldehyde","111-30-8"]
[null,"Glu-P-1","67730-11-4",{"$f":"IFERROR(VLOOKUP(C249,RBCs!$B$5:$C$265,2,FALSE),\"NoRBC\")","v":"NoRBC"}]
[null,"Glu-P-2","67730-10-3",{"$f":"IFERROR(VLOOKUP(C250,RBCs!$B$5:$C$265,2,FALSE),\"NoRBC\")","v":"NoRBC"}]
[null,"Gyromitrin","16568-02-8",{"$f":"IFERROR(VLOOKUP(C251,RBCs!$B$5:$C$265,2,FALSE),\"NoRBC\")","v":"NoRBC"}]
[null,"HC Blue 1","2784-94-3",{"$f":"IFERROR(VLOOKUP(C252,RBCs!$B$5:$C$265,2,FALSE),\"NoRBC\")","v":"NoRBC"}]
[null,"Heptachlor","76-44-8"]
[null,"Heptachlor epoxide","1024-57-3"]
[null,"Hexachlorobenzene","118-74-1"]
[null,"Hexachlorobutadiene","87-68-3"]
[null,"Hexachlorocyclohexanes (mixture) including but not limited to:","608-73-1"]
[null,"Hexachlorocyclohexane, alpha-","319-84-6"]
[null,"Hexachlorocyclohexane, beta-","319-85-7"]
[null,"Hexachlorocyclohexane, gamma- (Lindane)","58-89-9"]
[null,"Hexachlorocyclopentadiene","77-47-4"]
[null,"Hexachloroethane","67-72-1"]
[null,"Hexamethylphosphoramide","680-31-9",{"$f":"IFERROR(VLOOKUP(C263,RBCs!$B$5:$C$265,2,FALSE),\"NoRBC\")","v":"NoRBC"}]
[null,"Hexamethylene-1,6-diisocyanate","822-06-0"]
[null,"Hexane","110-54-3"]
[null,"Hydrazine","302-01-2"]
[null,"Hydrazine sulfate","10034-93-2",{"$f":"IFERROR(VLOOKUP(C267,RBCs!$B$5:$C$265,2,FALSE),\"NoRBC\")","v":"NoRBC"}]
[null,"Hydrochloric acid","7647-01-0"]
[null,"Hydrogen bromide","10035-10-6",{"$f":"IFERROR(VLOOKUP(C269,RBCs!$B$5:$C$265,2,FALSE),\"NoRBC\")","v":"NoRBC"}]
[null,"Hydrogen fluoride","7664-39-3"]
[null,"Hydrogen sulfide","7783-06-4"]
[null,"Hydroquinone","123-31-9",{"$f":"IFERROR(VLOOKUP(C272,RBCs!$B$5:$C$265,2,FALSE),\"NoRBC\")","v":"NoRBC"}]
[null,"Iodine-131","24267-56-9",{"$f":"IFERROR(VLOOKUP(C273,RBCs!$B$5:$C$265,2,FALSE),\"NoRBC\")","v":"NoRBC"}]
[null,"Iron pentacarbonyl","13463-40-6",{"$f":"IFERROR(VLOOKUP(C274,RBCs!$B$5:$C$265,2,FALSE),\"NoRBC\")","v":"NoRBC"}]
[null,"Isophorone","78-59-1"]
[null,"Isoprene, except from vegetative emission sources","78-79-5",{"$f":"IFERROR(VLOOKUP(C276,RBCs!$B$5:$C$265,2,FALSE),\"NoRBC\")","v":"NoRBC"}]
[null,"Isopropyl alcohol","67-63-0"]
[null,"Isopropylbenzene (Cumene)","98-82-8"]
[null,"4,4'-Isopropylidenediphenol","80-05-7",{"$f":"IFERROR(VLOOKUP(C279,RBCs!$B$5:$C$265,2,FALSE),\"NoRBC\")","v":"NoRBC"}]
[null,"Lasiocarpine","303-34-4",{"$f":"IFERROR(VLOOKUP(C280,RBCs!$B$5:$C$265,2,FALSE),\"NoRBC\")","v":"NoRBC"}]
[null,"Lead and compounds","7439-92-1"]
[null,"Lead chromate oxide","18454-12-1",{"$f":"IFERROR(VLOOKUP(C282,RBCs!$B$5:$C$265,2,FALSE),\"NoRBC\")","v":"NoRBC"}]
[null,"Maleic anhydride","108-31-6"]
[null,"Manganese and compounds","7439-96-5"]
[null,"Melphalan","148-82-3",{"$f":"IFERROR(VLOOKUP(C285,RBCs!$B$5:$C$265,2,FALSE),\"NoRBC\")","v":"NoRBC"}]
[null,"Melphalan HCl","3223-07-2",{"$f":"IFERROR(VLOOKUP(C286,RBCs!$B$5:$C$265,2,FALSE),\"NoRBC\")","v":"NoRBC"}]
[null,"Mercury and compounds","7439-97-6"]
[null,"Diethylmercury","627-44-1",{"$f":"IFERROR(VLOOKUP(C288,RBCs!$B$5:$C$265,2,FALSE),\"NoRBC\")","v":"NoRBC"}]
[null,"Dimethylmercury","593-74-8",{"$f":"IFERROR(VLOOKUP(C289,RBCs!$B$5:$C$265,2,FALSE),\"NoRBC\")","v":"NoRBC"}]
[null,"Methylmercury","22967-92-6",{"$f":"IFERROR(VLOOKUP(C290,RBCs!$B$5:$C$265,2,FALSE),\"NoRBC\")","v":"NoRBC"}]
[null,"Methanol","67-56-1"]
[null,"Methoxychlor","72-43-5",{"$f":"IFERROR(VLOOKUP(C292,RBCs!$B$5:$C$265,2,FALSE),\"NoRBC\")","v":"NoRBC"}]
[null,"Trans-2[(dimethylamino)-methylimino]-5-[2-(5-nitro-2-furyl)-vinyl]-1,3,4-oxadiazole","55738-54-0",{"$f":"IFERROR(VLOOKUP(C293,RBCs!$B$5:$C$265,2,FALSE),\"NoRBC\")","v":"NoRBC"}]
[null,"4,4'-Methylene bis(2-chloroaniline) (MOCA)","101-14-4"]
[null,"4,4'-Methylenedianiline (and its dichloride)","101-77-9"]
[null,"4,4-Methylenedianiline dihydrochloride","13552-44-8",{"$f":"IFERROR(VLOOKUP(C296,RBCs!$B$5:$C$265,2,FALSE),\"NoRBC\")","v":"NoRBC"}]
[null,"4,4-Methylene bis(2-methylaniline)","838-88-0",{"$f":"IFERROR(VLOOKUP(C297,RBCs!$B$5:$C$265,2,FALSE),\"NoRBC\")","v":"NoRBC"}]
[null,"4,4'-Methylene bis(N,N'-dimethyl)aniline","101-61-1",{"$f":"IFERROR(VLOOKUP(C298,RBCs!$B$5:$C$265,2,FALSE),\"NoRBC\")","v":"NoRBC"}]
[null,"Methylene diphenyl diisocyanate (MDI)","101-68-8"]
[null,"Methyl hydrazine","60-34-4",{"$f":"IFERROR(VLOOKUP(C300,RBCs!$B$5:$C$265,2,FALSE),\"NoRBC\")","v":"NoRBC"}]
[null,"1,2-Dimethylhydrazine","540-73-8",{"$f":"IFERROR(VLOOKUP(C301,RBCs!$B$5:$C$265,2,FALSE),\"NoRBC\")","v":"NoRBC"}]
[null,"Methyl iodide (Iodomethane)","74-88-4",{"$f":"IFERROR(VLOOKUP(C302,RBCs!$B$5:$C$265,2,FALSE),\"NoRBC\")","v":"NoRBC"}]
[null,"Methyl isobutyl ketone (MIBK, Hexone)","108-10-1"]
[null,"Methyl isocyanate","624-83-9"]
[null,"2-Methyllactonitrile (Acetone cyanohydrin)","75-86-5",{"$f":"IFERROR(VLOOKUP(C305,RBCs!$B$5:$C$265,2,FALSE),\"NoRBC\")","v":"NoRBC"}]
[null,"Methyl methacrylate","80-62-6"]
[null,"Methyl Methanesulfonate","66-27-3",{"$f":"IFERROR(VLOOKUP(C307,RBCs!$B$5:$C$265,2,FALSE),\"NoRBC\")","v":"NoRBC"}]
[null,"2-Methyl-1-nitroanthraquinone","129-15-7",{"$f":"IFERROR(VLOOKUP(C308,RBCs!$B$5:$C$265,2,FALSE),\"NoRBC\")","v":"NoRBC"}]
[null,"N-Methyl-N-nitro-N-nitrosoguanidine","70-25-7",{"$f":"IFERROR(VLOOKUP(C309,RBCs!$B$5:$C$265,2,FALSE),\"NoRBC\")","v":"NoRBC"}]
[null,"1-Methylphenanthrene","832-69-9",{"$f":"IFERROR(VLOOKUP(C310,RBCs!$B$5:$C$265,2,FALSE),\"NoRBC\")","v":"NoRBC"}]
[null,"1-Methylpyrene","2381-21-7",{"$f":"IFERROR(VLOOKUP(C311,RBCs!$B$5:$C$265,2,FALSE),\"NoRBC\")","v":"NoRBC"}]
[null,"2-Methylpyridine","109-06-8",{"$f":"IFERROR(VLOOKUP(C312,RBCs!$B$5:$C$265,2,FALSE),\"NoRBC\")","v":"NoRBC"}]
[null,"Methyl tert-butyl ether","1634-04-4"]
[null,"Methylthiouracil","56-04-2",{"$f":"IFERROR(VLOOKUP(C314,RBCs!$B$5:$C$265,2,FALSE),\"NoRBC\")","v":"NoRBC"}]
[null,"Michler's ketone","90-94-8"]
[null,"Mineral fiber emissions from facilities manufacturing or processing glass, rock, or slag fibers (or other mineral derived fibers) of average diameter 1 micrometer or less.","349",{"$f":"IFERROR(VLOOKUP(C316,RBCs!$B$5:$C$265,2,FALSE),\"NoRBC\")","v":"NoRBC"}]
[null,"Mineral fibers (fine mineral fibers which are man-made, and are airborne particles of a respirable size greater than 5 microns in length, less than or equal to 3.5 microns in diameter, with a length to diameter ratio of 3:1)","350",{"$f":"IFERROR(VLOOKUP(C317,RBCs!$B$5:$C$265,2,FALSE),\"NoRBC\")","v":"NoRBC"}]
[null,"Mirex","2385-85-5",{"$f":"IFERROR(VLOOKUP(C318,RBCs!$B$5:$C$265,2,FALSE),\"NoRBC\")","v":"NoRBC"}]
[null,"Mitomycin C","50-07-7",{"$f":"IFERROR(VLOOKUP(C319,RBCs!$B$5:$C$265,2,FALSE),\"NoRBC\")","v":"NoRBC"}]
[null,"Molybdenum trioxide","1313-27-5",{"$f":"IFERROR(VLOOKUP(C320,RBCs!$B$5:$C$265,2,FALSE),\"NoRBC\")","v":"NoRBC"}]
[null,"Monocrotaline","315-22-0",{"$f":"IFERROR(VLOOKUP(C321,RBCs!$B$5:$C$265,2,FALSE),\"NoRBC\")","v":"NoRBC"}]
[null,"2-Naphthylamine","91-59-8",{"$f":"IFERROR(VLOOKUP(C322,RBCs!$B$5:$C$265,2,FALSE),\"NoRBC\")","v":"NoRBC"}]
[null,"Naphthalene","91-20-3"]
[null,"Nickel and compounds","7440-02-0",{"$f":"IFERROR(VLOOKUP(C324,RBCs!$B$5:$C$265,2,FALSE),\"NoRBC\")","v":"NoRBC"}]
[null,"Nickel compounds, insoluble","365"]
[null,"Nickel oxide","1313-99-1",{"$f":"IFERROR(VLOOKUP(C326,RBCs!$B$5:$C$265,2,FALSE),\"NoRBC\")","v":"NoRBC"}]
[null,"Nickel subsulfide","12035-72-2",{"$f":"IFERROR(VLOOKUP(C327,RBCs!$B$5:$C$265,2,FALSE),\"NoRBC\")","v":"NoRBC"}]
[null,"Nickel sulfide","11113-75-0",{"$f":"IFERROR(VLOOKUP(C328,RBCs!$B$5:$C$265,2,FALSE),\"NoRBC\")","v":"NoRBC"}]
[null,"Nickel compounds, soluble","368"]
[null,"Nickel acetate","373-02-4",{"$f":"IFERROR(VLOOKUP(C330,RBCs!$B$5:$C$265,2,FALSE),\"NoRBC\")","v":"NoRBC"}]
[null,"Nickel carbonate","3333-67-3",{"$f":"IFERROR(VLOOKUP(C331,RBCs!$B$5:$C$265,2,FALSE),\"NoRBC\")","v":"NoRBC"}]
[null,"Nickel carbonate hydroxide","12607-70-4",{"$f":"IFERROR(VLOOKUP(C332,RBCs!$B$5:$C$265,2,FALSE),\"NoRBC\")","v":"NoRBC"}]
[null,"Nickel carbonyl","13463-39-3",{"$f":"IFERROR(VLOOKUP(C333,RBCs!$B$5:$C$265,2,FALSE),\"NoRBC\")","v":"NoRBC"}]
[null,"Nickel chloride","7718-54-9",{"$f":"IFERROR(VLOOKUP(C334,RBCs!$B$5:$C$265,2,FALSE),\"NoRBC\")","v":"NoRBC"}]
[null,"Nickel hydroxide","12054-48-7",{"$f":"IFERROR(VLOOKUP(C335,RBCs!$B$5:$C$265,2,FALSE),\"NoRBC\")","v":"NoRBC"}]
[null,"Nickel sulfate","7786-81-4",{"$f":"IFERROR(VLOOKUP(C336,RBCs!$B$5:$C$265,2,FALSE),\"NoRBC\")","v":"NoRBC"}]
[null,"Nickel sulfate hexahydrate","10101-97-0",{"$f":"IFERROR(VLOOKUP(C337,RBCs!$B$5:$C$265,2,FALSE),\"NoRBC\")","v":"NoRBC"}]
[null,"Nickel nitrate hexahydrate","13478-00-7",{"$f":"IFERROR(VLOOKUP(C338,RBCs!$B$5:$C$265,2,FALSE),\"NoRBC\")","v":"NoRBC"}]
[null,"Nickelocene","1271-28-9",{"$f":"IFERROR(VLOOKUP(C339,RBCs!$B$5:$C$265,2,FALSE),\"NoRBC\")","v":"NoRBC"}]
[null,"Nifurthiazole","3570-75-0",{"$f":"IFERROR(VLOOKUP(C340,RBCs!$B$5:$C$265,2,FALSE),\"NoRBC\")","v":"NoRBC"}]
[null,"Nitric acid","7697-37-2"]
[null,"Nitrilotriacetic acid","139-13-9",{"$f":"IFERROR(VLOOKUP(C342,RBCs!$B$5:$C$265,2,FALSE),\"NoRBC\")","v":"NoRBC"}]
[null,"Nitrilotriacetic acid, trisodium salt monohydrate","18662-53-8",{"$f":"IFERROR(VLOOKUP(C343,RBCs!$B$5:$C$265,2,FALSE),\"NoRBC\")","v":"NoRBC"}]
[null,"5-Nitro-o-Anisidine","99-59-2",{"$f":"IFERROR(VLOOKUP(C344,RBCs!$B$5:$C$265,2,FALSE),\"NoRBC\")","v":"NoRBC"}]
[null,"Nitrobenzene","98-95-3"]
[null,"4-Nitrobiphenyl","92-93-3",{"$f":"IFERROR(VLOOKUP(C346,RBCs!$B$5:$C$265,2,FALSE),\"NoRBC\")","v":"NoRBC"}]
[null,"Nitrofen","1836-75-5",{"$f":"IFERROR(VLOOKUP(C347,RBCs!$B$5:$C$265,2,FALSE),\"NoRBC\")","v":"NoRBC"}]
[null,"Nitrofurazone","59-87-0",{"$f":"IFERROR(VLOOKUP(C348,RBCs!$B$5:$C$265,2,FALSE),\"NoRBC\")","v":"NoRBC"}]
[null,"1-[(5-Nitrofurfurylidene)-amino]-2-imidazolidinone","555-84-0",{"$f":"IFERROR(VLOOKUP(C349,RBCs!$B$5:$C$265,2,FALSE),\"NoRBC\")","v":"NoRBC"}]
[null,"N-[4-(5-nitro-2-furyl)-2-thiazolyl]-acetamide","531-82-8",{"$f":"IFERROR(VLOOKUP(C350,RBCs!$B$5:$C$265,2,FALSE),\"NoRBC\")","v":"NoRBC"}]
[null,"Nitrogen mustard N-oxide","302-70-5",{"$f":"IFERROR(VLOOKUP(C351,RBCs!$B$5:$C$265,2,FALSE),\"NoRBC\")","v":"NoRBC"}]
[null,"4-Nitrophenol","100-02-7",{"$f":"IFERROR(VLOOKUP(C352,RBCs!$B$5:$C$265,2,FALSE),\"NoRBC\")","v":"NoRBC"}]
[null,"2-Nitropropane","79-46-9"]
[null,"N-Nitrosodi-n-butylamine","924-16-3"]
[null,"N-Nitrosodiethanolamine","1116-54-7",{"$f":"IFERROR(VLOOKUP(C355,RBCs!$B$5:$C$265,2,FALSE),\"NoRBC\")","v":"NoRBC"}]
[null,"N-Nitrosodiethylamine","55-18-5"]
[null,"N-Nitrosodimethylamine","62-75-9"]
[null,"N-Nitrosodiphenylamine","86-30-6"]
[null,"p-Nitrosodiphenylamine","156-10-5"]
[null,"N-Nitrosodi-n-propylamine","621-64-7"]
[null,"N-Nitrosomethylethylamine","10595-95-6"]
[null,"N-Nitroso-N-ethylurea","759-73-9",{"$f":"IFERROR(VLOOKUP(C362,RBCs!$B$5:$C$265,2,FALSE),\"NoRBC\")","v":"NoRBC"}]
[null,"N-Nitroso-N-methylurethane","615-53-2",{"$f":"IFERROR(VLOOKUP(C363,RBCs!$B$5:$C$265,2,FALSE),\"NoRBC\")","v":"NoRBC"}]
[null,"N-Nitroso-N-methylurea","684-93-5",{"$f":"IFERROR(VLOOKUP(C364,RBCs!$B$5:$C$265,2,FALSE),\"NoRBC\")","v":"NoRBC"}]
[null,"N-Nitrosomorpholine","59-89-2"]
[null,"N-Nitrosonornicotine","16543-55-8",{"$f":"IFERROR(VLOOKUP(C366,RBCs!$B$5:$C$265,2,FALSE),\"NoRBC\")","v":"NoRBC"}]
[null,"N-Nitrosopiperidine","100-75-4"]
[null,"N-Nitrosopyrrolidine","930-55-2"]
[null,"trans-Nonachlor","39765-80-5",{"$f":"IFERROR(VLOOKUP(C369,RBCs!$B$5:$C$265,2,FALSE),\"NoRBC\")","v":"NoRBC"}]
[null,"Nonyphenol, 4- (& ethoxylates)","104-40-5",{"$f":"IFERROR(VLOOKUP(C370,RBCs!$B$5:$C$265,2,FALSE),\"NoRBC\")","v":"NoRBC"}]
[null,"Oleum (fuming sulfuric acid)","8014-95-7"]
[null,"Parathion","56-38-2"]
[null,"Pentachlorophenol","87-86-5"]
[null,"Pentabromodiphenyl ether","32534-81-9",{"$f":"IFERROR(VLOOKUP(C374,RBCs!$B$5:$C$265,2,FALSE),\"NoRBC\")","v":"NoRBC"}]
[null,"Pentachloronitrobenzene (Quintobenzene)","82-68-8",{"$f":"IFERROR(VLOOKUP(C375,RBCs!$B$5:$C$265,2,FALSE),\"NoRBC\")","v":"NoRBC"}]
[null,"Peracetic acid","79-21-0",{"$f":"IFERROR(VLOOKUP(C376,RBCs!$B$5:$C$265,2,FALSE),\"NoRBC\")","v":"NoRBC"}]
[null,"Perfluorinated compounds (PFCs)","489",{"$f":"IFERROR(VLOOKUP(C377,RBCs!$B$5:$C$265,2,FALSE),\"NoRBC\")","v":"NoRBC"}]
[null,"Perfluorooctanoic acid (PFOA)","335-67-1",{"$f":"IFERROR(VLOOKUP(C378,RBCs!$B$5:$C$265,2,FALSE),\"NoRBC\")","v":"NoRBC"}]
[null,"Perfluorooctanesulfonic acid (PFOS)","1763-23-1",{"$f":"IFERROR(VLOOKUP(C379,RBCs!$B$5:$C$265,2,FALSE),\"NoRBC\")","v":"NoRBC"}]
[null,"Phenacetin","62-44-2",{"$f":"IFERROR(VLOOKUP(C380,RBCs!$B$5:$C$265,2,FALSE),\"NoRBC\")","v":"NoRBC"}]
[null,"Phenazopyridine","94-78-0",{"$f":"IFERROR(VLOOKUP(C381,RBCs!$B$5:$C$265,2,FALSE),\"NoRBC\")","v":"NoRBC"}]
[null,"Phenazopyridine hydrochloride","136-40-3",{"$f":"IFERROR(VLOOKUP(C382,RBCs!$B$5:$C$265,2,FALSE),\"NoRBC\")","v":"NoRBC"}]
[null,"Phenesterin","3546-10-9",{"$f":"IFERROR(VLOOKUP(C383,RBCs!$B$5:$C$265,2,FALSE),\"NoRBC\")","v":"NoRBC"}]
[null,"Phenobarbital","50-06-6",{"$f":"IFERROR(VLOOKUP(C384,RBCs!$B$5:$C$265,2,FALSE),\"NoRBC\")","v":"NoRBC"}]
[null,"Phenol","108-95-2"]
[null,"Phenoxybenzamine","59-96-1",{"$f":"IFERROR(VLOOKUP(C386,RBCs!$B$5:$C$265,2,FALSE),\"NoRBC\")","v":"NoRBC"}]
[null,"Phenoxybenzamine hydrochloride","63-92-3",{"$f":"IFERROR(VLOOKUP(C387,RBCs!$B$5:$C$265,2,FALSE),\"NoRBC\")","v":"NoRBC"}]
[null,"p-Phenylenediamine","106-50-3",{"$f":"IFERROR(VLOOKUP(C388,RBCs!$B$5:$C$265,2,FALSE),\"NoRBC\")","v":"NoRBC"}]
[null,"o-Phenylphenate, sodium","132-27-4",{"$f":"IFERROR(VLOOKUP(C389,RBCs!$B$5:$C$265,2,FALSE),\"NoRBC\")","v":"NoRBC"}]
[null,"2-Phenylphenol","90-43-7",{"$f":"IFERROR(VLOOKUP(C390,RBCs!$B$5:$C$265,2,FALSE),\"NoRBC\")","v":"NoRBC"}]
[null,"Phosgene","75-44-5"]
[null,"Phosphine","7803-51-2"]
[null,"Phosphoric acid","7664-38-2"]
[null,"Phosphorus and compounds","7723-14-0",{"$f":"IFERROR(VLOOKUP(C394,RBCs!$B$5:$C$265,2,FALSE),\"NoRBC\")","v":"NoRBC"}]
[null,"Phosphorus oxychloride","10025-87-3",{"$f":"IFERROR(VLOOKUP(C395,RBCs!$B$5:$C$265,2,FALSE),\"NoRBC\")","v":"NoRBC"}]
[null,"Phosphorus pentachloride","10026-13-8",{"$f":"IFERROR(VLOOKUP(C396,RBCs!$B$5:$C$265,2,FALSE),\"NoRBC\")","v":"NoRBC"}]
[null,"Phosphorus pentoxide","1314-56-3",{"$f":"IFERROR(VLOOKUP(C397,RBCs!$B$5:$C$265,2,FALSE),\"NoRBC\")","v":"NoRBC"}]
[null,"Phosphorus trichloride","7719-12-2",{"$f":"IFERROR(VLOOKUP(C398,RBCs!$B$5:$C$265,2,FALSE),\"NoRBC\")","v":"NoRBC"}]
[null,"Phosphorus, white","12185-10-3"]
[null,"Phthalates","518",{"$f":"IFERROR(VLOOKUP(C400,RBCs!$B$5:$C$265,2,FALSE),\"NoRBC\")","v":"NoRBC"}]
[null,"Phthalic anhydride","85-44-9"]
[null,"Polybrominated diphenyl ethers (PBDEs)","447"]
[null,"PBDE-47 [2,2',4,4'-Tetrabromodiphenyl ether]","5436-43-1",{"$f":"IFERROR(VLOOKUP(C403,RBCs!$B$5:$C$265,2,FALSE),\"NoRBC\")","v":"NoRBC"}]
[null,"PBDE-99 [2,2’,4,4’,5-Pentabromodiphenyl ether]","60348-60-9",{"$f":"IFERROR(VLOOKUP(C404,RBCs!$B$5:$C$265,2,FALSE),\"NoRBC\")","v":"NoRBC"}]
[null,"PBDE-100 [2,2’,4,4’,6-Pentabromodiphenyl ether]","189084-64-8",{"$f":"IFERROR(VLOOKUP(C405,RBCs!$B$5:$C$265,2,FALSE),\"NoRBC\")","v":"NoRBC"}]
[null,"PBDE-138 [2,2’,3,4,4’,5’-Hexabromodiphenyl ether]","17026-54-3",{"$f":"IFERROR(VLOOKUP(C406,RBCs!$B$5:$C$265,2,FALSE),\"NoRBC\")","v":"NoRBC"}]
[null,"PBDE-153 [2,2',4,4',5,5'-hexabromodiphenyl ether]","68631-49-2",{"$f":"IFERROR(VLOOKUP(C407,RBCs!$B$5:$C$265,2,FALSE),\"NoRBC\")","v":"NoRBC"}]
[null,"PBDE-154 [2,2’,4,4’,5,6’-Hexabromodiphenyl ether]","17026-58-4",{"$f":"IFERROR(VLOOKUP(C408,RBCs!$B$5:$C$265,2,FALSE),\"NoRBC\")","v":"NoRBC"}]
[null,"PBDE-185 [2,2',3,4,4',5',6-Heptabromodiphenyl ether]","68928-80-3",{"$f":"IFERROR(VLOOKUP(C409,RBCs!$B$5:$C$265,2,FALSE),\"NoRBC\")","v":"NoRBC"}]
[null,"PBDE-209 [Decabromodiphenyl ether]","1163-19-5",{"$f":"IFERROR(VLOOKUP(C410,RBCs!$B$5:$C$265,2,FALSE),\"NoRBC\")","v":"NoRBC"}]
[null,"Polychlorinated biphenyls (PCBs)","1336-36-3"]
[null,"Polychlorinated biphenyls (PCBs) TEQ","645"]
[null,"PCB-8 [2,4'-dichlorobiphenyl]","34883-43-7",{"$f":"IFERROR(VLOOKUP(C413,RBCs!$B$5:$C$265,2,FALSE),\"NoRBC\")","v":"NoRBC"}]
[null,"PCB 18 [2,2',5-trichlorobiphenyl]","37680-65-2",{"$f":"IFERROR(VLOOKUP(C414,RBCs!$B$5:$C$265,2,FALSE),\"NoRBC\")","v":"NoRBC"}]
[null,"PCB-28 [2,4,4'-trichlorobiphenyl]","7012-37-5",{"$f":"IFERROR(VLOOKUP(C415,RBCs!$B$5:$C$265,2,FALSE),\"NoRBC\")","v":"NoRBC"}]
[null,"PCB-44 [2,2',3,5'-tetrachlorobiphenyl]","41464-39-5",{"$f":"IFERROR(VLOOKUP(C416,RBCs!$B$5:$C$265,2,FALSE),\"NoRBC\")","v":"NoRBC"}]
[null,"PCB-52 [2,2',5,5'-tetrachlorobiphenyl]","35693-99-3",{"$f":"IFERROR(VLOOKUP(C417,RBCs!$B$5:$C$265,2,FALSE),\"NoRBC\")","v":"NoRBC"}]
[null,"PCB-66 [2,3',4,4'-tetrachlorobiphenyl]","32598-10-0",{"$f":"IFERROR(VLOOKUP(C418,RBCs!$B$5:$C$265,2,FALSE),\"NoRBC\")","v":"NoRBC"}]
[null,"PCB 77 [3,3',4,4'-tetrachlorobiphenyl]","32598-13-3"]
[null,"PCB 81 [3,4,4',5-tetrachlorobiphenyl]","70362-50-4"]
[null,"PCB-101 [2,2',4,5,5'-pentachlorobiphenyl]","37680-73-2",{"$f":"IFERROR(VLOOKUP(C421,RBCs!$B$5:$C$265,2,FALSE),\"NoRBC\")","v":"NoRBC"}]
[null,"PCB 105 [2,3,3',4,4'-pentachlorobiphenyl]","32598-14-4"]
[null,"PCB 114 [2,3,4,4',5-pentachlorobiphenyl]","74472-37-0"]
[null,"PCB 118 [2,3',4,4',5-pentachlorobiphenyl]","31508-00-6"]
[null,"PCB 123 [2,3',4,4',5'-pentachlorobiphenyl]","65510-44-3"]
[null,"PCB 126 [3,3',4,4',5-pentachlorobiphenyl]","57465-28-8"]
[null,"PCB-128 [2,2',3,3',4,4'-hexachlorobiphenyl]","38380-07-3",{"$f":"IFERROR(VLOOKUP(C427,RBCs!$B$5:$C$265,2,FALSE),\"NoRBC\")","v":"NoRBC"}]
[null,"PCB-138 [2,2',3,4,4',5'-hexachlorobiphenyl]","35065-28-2",{"$f":"IFERROR(VLOOKUP(C428,RBCs!$B$5:$C$265,2,FALSE),\"NoRBC\")","v":"NoRBC"}]
[null,"PCB-153 [2,2',4,4',5,5'-hexachlorobiphenyl]","35065-27-1",{"$f":"IFERROR(VLOOKUP(C429,RBCs!$B$5:$C$265,2,FALSE),\"NoRBC\")","v":"NoRBC"}]
[null,"PCB 156 [2,3,3',4,4',5-hexachlorobiphenyl]","38380-08-4"]
[null,"PCB 157 [2,3,3',4,4',5'-hexachlorobiphenyl]","69782-90-7"]
[null,"PCB 167 [2,3',4,4',5,5'-hexachlorobiphenyl]","52663-72-6"]
[null,"PCB 169 [3,3',4,4',5,5'-hexachlorobiphenyl]","32774-16-6"]
[null,"PCB-170 [2,2',3,3',4,4',5-heptachlorobiphenyl]","35065-30-6",{"$f":"IFERROR(VLOOKUP(C434,RBCs!$B$5:$C$265,2,FALSE),\"NoRBC\")","v":"NoRBC"}]
[null,"PCB-180 [2,2',3,4,4',5,5'-heptachlorobiphenyl]","35065-29-3",{"$f":"IFERROR(VLOOKUP(C435,RBCs!$B$5:$C$265,2,FALSE),\"NoRBC\")","v":"NoRBC"}]
[null,"PCB-187 [2,2',3,4',5,5',6-heptachlorobiphenyl]","52663-68-0",{"$f":"IFERROR(VLOOKUP(C436,RBCs!$B$5:$C$265,2,FALSE),\"NoRBC\")","v":"NoRBC"}]
[null,"PCB 189 [2,3,3',4,4',5,5'-heptachlorobiphenyl]","39635-31-9"]
[null,"PCB-195 [2,2',3,3',4,4',5,6-octachlorobiphenyl]","52663-78-2",{"$f":"IFERROR(VLOOKUP(C438,RBCs!$B$5:$C$265,2,FALSE),\"NoRBC\")","v":"NoRBC"}]
[null,"PCB-206 [2,2',3,3',4,4',5,5',6-nonachlorobiphenyl]","40186-72-9",{"$f":"IFERROR(VLOOKUP(C439,RBCs!$B$5:$C$265,2,FALSE),\"NoRBC\")","v":"NoRBC"}]
[null,"PCB-209 [2,2'3,3',4,4',5,5',6,6 '-decachlorobiphenyl]","2051-24-3",{"$f":"IFERROR(VLOOKUP(C440,RBCs!$B$5:$C$265,2,FALSE),\"NoRBC\")","v":"NoRBC"}]
[null,"Polychlorinated dibenzo-p-dioxins (PCDDs) & dibenzofurans (PCDFs) TEQ","646"]
[null,"2,3,7,8-Tetrachlorodibenzo-p-dioxin (TCDD)","1746-01-6"]
[null,"1,2,3,7,8-Pentachlorodibenzo-p-dioxin (PeCDD)","40321-76-4"]
[null,"1,2,3,4,7,8-Hexachlorodibenzo-p-dioxin (HxCDD)","39227-28-6"]
[null,"1,2,3,6,7,8-Hexachlorodibenzo-p-dioxin (HxCDD)","57653-85-7"]
[null,"1,2,3,7,8,9-Hexachlorodibenzo-p-dioxin (HxCDD)","19408-74-3"]
[null,"1,2,3,4,6,7,8-Heptachlorodibenzo-p-dioxin (HpCDD)","35822-46-9"]
[null,"Octachlorodibenzo-p-dioxin (OCDD)","3268-87-9"]
[null,"2,3,7,8-Tetrachlorodibenzofuran (TcDF)","51207-31-9"]
[null,"1,2,3,7,8-Pentachlorodibenzofuran (PeCDF)","57117-41-6"]
[null,"2,3,4,7,8-Pentachlorodibenzofuran (PeCDF)","57117-31-4"]
[null,"1,2,3,4,7,8-Hexachlorodibenzofuran (HxCDF)","70648-26-9"]
[null,"1,2,3,6,7,8-Hexachlorodibenzofuran (HxCDF)","57117-44-9"]
[null,"1,2,3,7,8,9-Hexachlorodibenzofuran (HxCDF)","72918-21-9"]
[null,"2,3,4,6,7,8-Hexachlorodibenzofuran (HxCDF)","60851-34-5"]
[null,"1,2,3,4,6,7,8-Heptachlorodibenzofuran (HpCDF)","67562-39-4"]
[null,"1,2,3,4,7,8,9-Heptachlorodibenzofuran (HpCDF)","55673-89-7"]
[null,"Octachlorodibenzofuran (OCDF)","39001-02-0"]
[null,"Polycyclic aromatic hydrocarbons (PAHs)","401"]
[null,"Acenaphthene","83-32-9",{"$f":"IFERROR(VLOOKUP(C460,RBCs!$B$5:$C$265,2,FALSE),\"NoRBC\")","v":"NoRBC"}]
[null,"Acenaphthylene","208-96-8",{"$f":"IFERROR(VLOOKUP(C461,RBCs!$B$5:$C$265,2,FALSE),\"NoRBC\")","v":"NoRBC"}]
[null,"Anthracene","120-12-7",{"$f":"IFERROR(VLOOKUP(C462,RBCs!$B$5:$C$265,2,FALSE),\"NoRBC\")","v":"NoRBC"}]
[null,"Anthanthrene","191-26-4"]
[null,"Benz[a]anthracene","56-55-3"]
[null,"Benzo[a]pyrene","50-32-8"]
[null,"Benzo[b]fluoranthene","205-99-2"]
[null,"Benzo[c]fluorene","205-12-9"]
[null,"Benzo[e]pyrene","192-97-2",{"$f":"IFERROR(VLOOKUP(C468,RBCs!$B$5:$C$265,2,FALSE),\"NoRBC\")","v":"NoRBC"}]
[null,"Benzo[g,h,i]perylene","191-24-2"]
[null,"Benzo[j]fluoranthene","205-82-3"]
[null,"Benzo[k]fluoranthene","207-08-9"]
[null,"Carbazole","86-74-8",{"$f":"IFERROR(VLOOKUP(C472,RBCs!$B$5:$C$265,2,FALSE),\"NoRBC\")","v":"NoRBC"}]
[null,"Chrysene","218-01-9"]
[null,"Cyclopenta[c,d]pyrene","27208-37-3"]
[null,"Dibenz[a,h]acridine","226-36-8",{"$f":"IFERROR(VLOOKUP(C475,RBCs!$B$5:$C$265,2,FALSE),\"NoRBC\")","v":"NoRBC"}]
[null,"Dibenz[a,j]acridine","224-42-0",{"$f":"IFERROR(VLOOKUP(C476,RBCs!$B$5:$C$265,2,FALSE),\"NoRBC\")","v":"NoRBC"}]
[null,"7H-Dibenzo[c,g]carbazole","194-59-2",{"$f":"IFERROR(VLOOKUP(C477,RBCs!$B$5:$C$265,2,FALSE),\"NoRBC\")","v":"NoRBC"}]
[null,"Dibenz[a,h]anthracene","53-70-3"]
[null,"Dibenzo[a,e]fluoranthene","5385-75-1",{"$f":"IFERROR(VLOOKUP(C479,RBCs!$B$5:$C$265,2,FALSE),\"NoRBC\")","v":"NoRBC"}]
[null,"Dibenzo[a,e]pyrene","192-65-4"]
[null,"Dibenzo[a,h]pyrene","189-64-0"]
[null,"Dibenzo[a,i]pyrene","189-55-9"]
[null,"Dibenzo[a,l]pyrene","191-30-0"]
[null,"Fluoranthene","206-44-0"]
[null,"Fluorene","86-73-7",{"$f":"IFERROR(VLOOKUP(C485,RBCs!$B$5:$C$265,2,FALSE),\"NoRBC\")","v":"NoRBC"}]
[null,"Indeno[1,2,3-cd]pyrene","193-39-5"]
[null,"2-Methyl naphthalene","91-57-6",{"$f":"IFERROR(VLOOKUP(C487,RBCs!$B$5:$C$265,2,FALSE),\"NoRBC\")","v":"NoRBC"}]
[null,"Perylene","198-55-0",{"$f":"IFERROR(VLOOKUP(C488,RBCs!$B$5:$C$265,2,FALSE),\"NoRBC\")","v":"NoRBC"}]
[null,"Phenanthrene","85-01-8",{"$f":"IFERROR(VLOOKUP(C489,RBCs!$B$5:$C$265,2,FALSE),\"NoRBC\")","v":"NoRBC"}]
[null,"Pyrene","129-00-0",{"$f":"IFERROR(VLOOKUP(C490,RBCs!$B$5:$C$265,2,FALSE),\"NoRBC\")","v":"NoRBC"}]
[null,"Polycyclic aromatic hydrocarbon derivatives [PAH-Derivatives]","432",{"$f":"IFERROR(VLOOKUP(C491,RBCs!$B$5:$C$265,2,FALSE),\"NoRBC\")","v":"NoRBC"}]
[null,"2-Acetylaminofluorene","53-96-3",{"$f":"IFERROR(VLOOKUP(C492,RBCs!$B$5:$C$265,2,FALSE),\"NoRBC\")","v":"NoRBC"}]
[null,"2-Aminoanthraquinone","117-79-3",{"$f":"IFERROR(VLOOKUP(C493,RBCs!$B$5:$C$265,2,FALSE),\"NoRBC\")","v":"NoRBC"}]
[null,"Carbaryl","63-25-2",{"$f":"IFERROR(VLOOKUP(C494,RBCs!$B$5:$C$265,2,FALSE),\"NoRBC\")","v":"NoRBC"}]
[null,"7,12-Dimethylbenz[a]anthracene","57-97-6",{"$f":"IFERROR(VLOOKUP(C495,RBCs!$B$5:$C$265,2,FALSE),\"NoRBC\")","v":"NoRBC"}]
[null,"1,6-Dinitropyrene","42397-64-8",{"$f":"IFERROR(VLOOKUP(C496,RBCs!$B$5:$C$265,2,FALSE),\"NoRBC\")","v":"NoRBC"}]
[null,"1,8-Dinitropyrene","42397-65-9",{"$f":"IFERROR(VLOOKUP(C497,RBCs!$B$5:$C$265,2,FALSE),\"NoRBC\")","v":"NoRBC"}]
[null,"3-Methylcholanthrene","56-49-5",{"$f":"IFERROR(VLOOKUP(C498,RBCs!$B$5:$C$265,2,FALSE),\"NoRBC\")","v":"NoRBC"}]
[null,"5-Methylchrysene","3697-24-3"]
[null,"5-Nitroacenaphthene","602-87-9",{"$f":"IFERROR(VLOOKUP(C500,RBCs!$B$5:$C$265,2,FALSE),\"NoRBC\")","v":"NoRBC"}]
[null,"6-Nitrochrysene","7496-02-8"]
[null,"2-Nitrofluorene","607-57-8",{"$f":"IFERROR(VLOOKUP(C502,RBCs!$B$5:$C$265,2,FALSE),\"NoRBC\")","v":"NoRBC"}]
[null,"1-Nitropyrene","5522-43-0",{"$f":"IFERROR(VLOOKUP(C503,RBCs!$B$5:$C$265,2,FALSE),\"NoRBC\")","v":"NoRBC"}]
[null,"4-Nitropyrene","57835-92-4",{"$f":"IFERROR(VLOOKUP(C504,RBCs!$B$5:$C$265,2,FALSE),\"NoRBC\")","v":"NoRBC"}]
[null,"Ponceau 3R","3564-09-8",{"$f":"IFERROR(VLOOKUP(C505,RBCs!$B$5:$C$265,2,FALSE),\"NoRBC\")","v":"NoRBC"}]
[null,"Ponceau MX","3761-53-3",{"$f":"IFERROR(VLOOKUP(C506,RBCs!$B$5:$C$265,2,FALSE),\"NoRBC\")","v":"NoRBC"}]
[null,"Potassium bromate","7758-01-2"]
[null,"Procarbazine","671-16-9",{"$f":"IFERROR(VLOOKUP(C508,RBCs!$B$5:$C$265,2,FALSE),\"NoRBC\")","v":"NoRBC"}]
[null,"Procarbazine hydrochloride","366-70-1",{"$f":"IFERROR(VLOOKUP(C509,RBCs!$B$5:$C$265,2,FALSE),\"NoRBC\")","v":"NoRBC"}]
[null,"1,3-Propane sultone","1120-71-4"]
[null,"beta-Propiolactone","57-57-8",{"$f":"IFERROR(VLOOKUP(C511,RBCs!$B$5:$C$265,2,FALSE),\"NoRBC\")","v":"NoRBC"}]
[null,"Propionaldehyde","123-38-6"]
[null,"Propoxur (Baygon)","114-26-1",{"$f":"IFERROR(VLOOKUP(C513,RBCs!$B$5:$C$265,2,FALSE),\"NoRBC\")","v":"NoRBC"}]
[null,"Propylene","115-07-1"]
[null,"Propylene glycol dinitrate","6423-43-4"]
[null,"Propylene glycol monomethyl ether","107-98-2"]
[null,"Propylene glycol monomethyl ether acetate","108-65-6",{"$f":"IFERROR(VLOOKUP(C517,RBCs!$B$5:$C$265,2,FALSE),\"NoRBC\")","v":"NoRBC"}]
[null,"Propylene oxide","75-56-9"]
[null,"1,2-Propyleneimine (2-Methylaziridine)","75-55-8",{"$f":"IFERROR(VLOOKUP(C519,RBCs!$B$5:$C$265,2,FALSE),\"NoRBC\")","v":"NoRBC"}]
[null,"Propylthiouracil","51-52-5",{"$f":"IFERROR(VLOOKUP(C520,RBCs!$B$5:$C$265,2,FALSE),\"NoRBC\")","v":"NoRBC"}]
[null,"Pyridine","110-86-1",{"$f":"IFERROR(VLOOKUP(C521,RBCs!$B$5:$C$265,2,FALSE),\"NoRBC\")","v":"NoRBC"}]
[null,"Quinoline","91-22-5",{"$f":"IFERROR(VLOOKUP(C522,RBCs!$B$5:$C$265,2,FALSE),\"NoRBC\")","v":"NoRBC"}]
[null,"Quinone","106-51-4",{"$f":"IFERROR(VLOOKUP(C523,RBCs!$B$5:$C$265,2,FALSE),\"NoRBC\")","v":"NoRBC"}]
[null,"Radionuclides","569",{"$f":"IFERROR(VLOOKUP(C524,RBCs!$B$5:$C$265,2,FALSE),\"NoRBC\")","v":"NoRBC"}]
[null,"Radon and its decay products","571",{"$f":"IFERROR(VLOOKUP(C525,RBCs!$B$5:$C$265,2,FALSE),\"NoRBC\")","v":"NoRBC"}]
[null,"Refractory Ceramic Fibers","572"]
[null,"Reserpine","50-55-5",{"$f":"IFERROR(VLOOKUP(C527,RBCs!$B$5:$C$265,2,FALSE),\"NoRBC\")","v":"NoRBC"}]
[null,"Rockwool","353",{"$f":"IFERROR(VLOOKUP(C528,RBCs!$B$5:$C$265,2,FALSE),\"NoRBC\")","v":"NoRBC"}]
[null,"Safrole","94-59-7",{"$f":"IFERROR(VLOOKUP(C529,RBCs!$B$5:$C$265,2,FALSE),\"NoRBC\")","v":"NoRBC"}]
[null,"Selenide, hydrogen","7783-07-5"]
[null,"Selenium and compounds","7782-49-2"]
[null,"Selenium sulfide","7446-34-6",{"$f":"IFERROR(VLOOKUP(C532,RBCs!$B$5:$C$265,2,FALSE),\"NoRBC\")","v":"NoRBC"}]
[null,"Silica, crystalline (respirable)","7631-86-9"]
[null,"Silver and compounds","7440-22-4",{"$f":"IFERROR(VLOOKUP(C534,RBCs!$B$5:$C$265,2,FALSE),\"NoRBC\")","v":"NoRBC"}]
[null,"Slagwool","354",{"$f":"IFERROR(VLOOKUP(C535,RBCs!$B$5:$C$265,2,FALSE),\"NoRBC\")","v":"NoRBC"}]
[null,"Sodium hydroxide","1310-73-2"]
[null,"Sterigmatocystin","10048-13-2",{"$f":"IFERROR(VLOOKUP(C537,RBCs!$B$5:$C$265,2,FALSE),\"NoRBC\")","v":"NoRBC"}]
[null,"Streptozotocin","18883-66-4",{"$f":"IFERROR(VLOOKUP(C538,RBCs!$B$5:$C$265,2,FALSE),\"NoRBC\")","v":"NoRBC"}]
[null,"Styrene","100-42-5"]
[null,"Styrene oxide","96-09-3",{"$f":"IFERROR(VLOOKUP(C540,RBCs!$B$5:$C$265,2,FALSE),\"NoRBC\")","v":"NoRBC"}]
[null,"Sulfallate","95-06-7",{"$f":"IFERROR(VLOOKUP(C541,RBCs!$B$5:$C$265,2,FALSE),\"NoRBC\")","v":"NoRBC"}]
[null,"Sulfuric acid","7664-93-9"]
[null,"Sulfur mustard","505-60-2"]
[null,"Sulfur trioxide","7446-71-9"]
[null,"Talc containing asbestiform fibers","358",{"$f":"IFERROR(VLOOKUP(C545,RBCs!$B$5:$C$265,2,FALSE),\"NoRBC\")","v":"NoRBC"}]
[null,"Terephthalic acid","100-21-0",{"$f":"IFERROR(VLOOKUP(C546,RBCs!$B$5:$C$265,2,FALSE),\"NoRBC\")","v":"NoRBC"}]
[null,"Tetrabromodiphenyl ether","40088-47-9",{"$f":"IFERROR(VLOOKUP(C547,RBCs!$B$5:$C$265,2,FALSE),\"NoRBC\")","v":"NoRBC"}]
[null,"1,1,1,2-Tetrachloroethane","630-20-6"]
[null,"1,1,2,2-Tetrachloroethane","79-34-5"]
[null,"Tetrachloroethene (Perchloroethylene)","127-18-4"]
[null,"2,3,4,6-Tetrachlorophenol","58-90-2",{"$f":"IFERROR(VLOOKUP(C551,RBCs!$B$5:$C$265,2,FALSE),\"NoRBC\")","v":"NoRBC"}]
[null,"1,1,1,2-Tetrafluoroethane","811-97-2"]
[null,"Thallium and compounds","7440-28-0",{"$f":"IFERROR(VLOOKUP(C553,RBCs!$B$5:$C$265,2,FALSE),\"NoRBC\")","v":"NoRBC"}]
[null,"Thioacetamide","62-55-5"]
[null,"4,4-Thiodianiline","139-65-1",{"$f":"IFERROR(VLOOKUP(C555,RBCs!$B$5:$C$265,2,FALSE),\"NoRBC\")","v":"NoRBC"}]
[null,"Thiourea","62-56-6",{"$f":"IFERROR(VLOOKUP(C556,RBCs!$B$5:$C$265,2,FALSE),\"NoRBC\")","v":"NoRBC"}]
[null,"Titanium tetrachloride","7550-45-0"]
[null,"Toluene","108-88-3"]
[null,"Toluene diisocyanates (2,4- and 2,6-)","26471-62-5"]
[null,"Toluene-2,4-diisocyanate","584-84-9",{"$f":"IFERROR(VLOOKUP(C560,RBCs!$B$5:$C$265,2,FALSE),\"NoRBC\")","v":"NoRBC"}]
[null,"Toluene-2,6-diisocyanate","91-08-7",{"$f":"IFERROR(VLOOKUP(C561,RBCs!$B$5:$C$265,2,FALSE),\"NoRBC\")","v":"NoRBC"}]
[null,"o-Toluidine","95-53-4",{"$f":"IFERROR(VLOOKUP(C562,RBCs!$B$5:$C$265,2,FALSE),\"NoRBC\")","v":"NoRBC"}]
[null,"o-Toluidine hydrochloride","636-21-5",{"$f":"IFERROR(VLOOKUP(C563,RBCs!$B$5:$C$265,2,FALSE),\"NoRBC\")","v":"NoRBC"}]
[null,"Total Tetrachlorodibenzo-p-dioxin","41903-57-5",{"$f":"IFERROR(VLOOKUP(C564,RBCs!$B$5:$C$265,2,FALSE),\"NoRBC\")","v":"NoRBC"}]
[null,"Total Pentachlorodibenzo-p-dioxin","36088-22-9",{"$f":"IFERROR(VLOOKUP(C565,RBCs!$B$5:$C$265,2,FALSE),\"NoRBC\")","v":"NoRBC"}]
[null,"Total Hexachlorodibenzo-p-dioxin","34465-46-8",{"$f":"IFERROR(VLOOKUP(C566,RBCs!$B$5:$C$265,2,FALSE),\"NoRBC\")","v":"NoRBC"}]
[null,"Total Heptachlorodibenzo-p-dioxin","37871-00-4",{"$f":"IFERROR(VLOOKUP(C567,RBCs!$B$5:$C$265,2,FALSE),\"NoRBC\")","v":"NoRBC"}]
[null,"Total Tetrachlorodibenzofuran","55722-27-5",{"$f":"IFERROR(VLOOKUP(C568,RBCs!$B$5:$C$265,2,FALSE),\"NoRBC\")","v":"NoRBC"}]
[null,"Total Pentachlorodibenzofuran","30402-15-4",{"$f":"IFERROR(VLOOKUP(C569,RBCs!$B$5:$C$265,2,FALSE),\"NoRBC\")","v":"NoRBC"}]
[null,"Total Hexachlorodibenzofuran","55684-94-1",{"$f":"IFERROR(VLOOKUP(C570,RBCs!$B$5:$C$265,2,FALSE),\"NoRBC\")","v":"NoRBC"}]
[null,"Total Heptachlorodibenzofuran","38998-75-3",{"$f":"IFERROR(VLOOKUP(C571,RBCs!$B$5:$C$265,2,FALSE),\"NoRBC\")","v":"NoRBC"}]
[null,"Toxaphene (Polychlorinated camphenes)","8001-35-2"]
[null,"Tributyl phosphate","126-73-8",{"$f":"IFERROR(VLOOKUP(C573,RBCs!$B$5:$C$265,2,FALSE),\"NoRBC\")","v":"NoRBC"}]
[null,"1,2,4-Trichlorobenzene","120-82-1",{"$f":"IFERROR(VLOOKUP(C574,RBCs!$B$5:$C$265,2,FALSE),\"NoRBC\")","v":"NoRBC"}]
[null,"1,1,1-Trichloroethane (Methyl chloroform)","71-55-6"]
[null,"1,1,2-Trichloroethane (Vinyl trichloride)","79-00-5"]
[null,"Trichloroethene (TCE, Trichloroethylene)","79-01-6"]
[null,"Trichlorofluoromethane (Freon 11)","75-69-4",{"$f":"IFERROR(VLOOKUP(C578,RBCs!$B$5:$C$265,2,FALSE),\"NoRBC\")","v":"NoRBC"}]
[null,"2,4,5-Trichlorophenol","95-95-4",{"$f":"IFERROR(VLOOKUP(C579,RBCs!$B$5:$C$265,2,FALSE),\"NoRBC\")","v":"NoRBC"}]
[null,"2,4,6-Trichlorophenol","88-06-2"]
[null,"1,2,3-Trichloropropane","96-18-4"]
[null,"Triethyl phosphine","78-40-0",{"$f":"IFERROR(VLOOKUP(C582,RBCs!$B$5:$C$265,2,FALSE),\"NoRBC\")","v":"NoRBC"}]
[null,"Triethylamine","121-44-8"]
[null,"Triethylene glycol dimethyl ether","112-49-2",{"$f":"IFERROR(VLOOKUP(C584,RBCs!$B$5:$C$265,2,FALSE),\"NoRBC\")","v":"NoRBC"}]
[null,"Trimethyl phosphate","512-56-1",{"$f":"IFERROR(VLOOKUP(C585,RBCs!$B$5:$C$265,2,FALSE),\"NoRBC\")","v":"NoRBC"}]
[null,"Triorthocresyl phosphate","78-30-8",{"$f":"IFERROR(VLOOKUP(C586,RBCs!$B$5:$C$265,2,FALSE),\"NoRBC\")","v":"NoRBC"}]
[null,"Triphenyl phosphate","115-86-6",{"$f":"IFERROR(VLOOKUP(C587,RBCs!$B$5:$C$265,2,FALSE),\"NoRBC\")","v":"NoRBC"}]
[null,"Triphenyl phosphite","101-02-0",{"$f":"IFERROR(VLOOKUP(C588,RBCs!$B$5:$C$265,2,FALSE),\"NoRBC\")","v":"NoRBC"}]
[null,"Trifluralin","1582-09-8",{"$f":"IFERROR(VLOOKUP(C589,RBCs!$B$5:$C$265,2,FALSE),\"NoRBC\")","v":"NoRBC"}]
[null,"1,2,3-Trimethylbenzene","526-73-8"]
[null,"1,2,4-Trimethylbenzene","95-63-6"]
[null,"1,3,5-Trimethylbenzene","108-67-8"]
[null,"2,2,4-Trimethylpentane","540-84-1",{"$f":"IFERROR(VLOOKUP(C593,RBCs!$B$5:$C$265,2,FALSE),\"NoRBC\")","v":"NoRBC"}]
[null,"Tryptophan-P-1","62450-06-0",{"$f":"IFERROR(VLOOKUP(C594,RBCs!$B$5:$C$265,2,FALSE),\"NoRBC\")","v":"NoRBC"}]
[null,"Tryptophan-P-2","62450-07-1",{"$f":"IFERROR(VLOOKUP(C595,RBCs!$B$5:$C$265,2,FALSE),\"NoRBC\")","v":"NoRBC"}]
[null,"Urethane (Ethyl carbamate)","51-79-6"]
[null,"Vanadium (fume or dust)","7440-62-2"]
[null,"Vanadium pentoxide","1314-62-1"]
[null,"Vinyl acetate","108-05-4"]
[null,"Vinyl bromide","593-60-2"]
[null,"Vinyl chloride","75-01-4"]
[null,"4-Vinylcyclohexene","100-40-3",{"$f":"IFERROR(VLOOKUP(C602,RBCs!$B$5:$C$265,2,FALSE),\"NoRBC\")","v":"NoRBC"}]
[null,"Vinyl fluoride","75-02-5",{"$f":"IFERROR(VLOOKUP(C603,RBCs!$B$5:$C$265,2,FALSE),\"NoRBC\")","v":"NoRBC"}]
[null,"Vinylidene chloride","75-35-4"]
[null,"Xylene (mixture), including m-xylene, o-xylene, p-xylene","1330-20-7"]
[null,"m-Xylene","108-38-3",{"$f":"IFERROR(VLOOKUP(C606,RBCs!$B$5:$C$265,2,FALSE),\"NoRBC\")","v":"NoRBC"}]
[null,"o-Xylene","95-47-6",{"$f":"IFERROR(VLOOKUP(C607,RBCs!$B$5:$C$265,2,FALSE),\"NoRBC\")","v":"NoRBC"}]
[null,"p-Xylene","106-42-3",{"$f":"IFERROR(VLOOKUP(C608,RBCs!$B$5:$C$265,2,FALSE),\"NoRBC\")","v":"NoRBC"}]
[null,"Zinc and compounds","7440-66-6",{"$f":"IFERROR(VLOOKUP(C609,RBCs!$B$5:$C$265,2,FALSE),\"NoRBC\")","v":"NoRBC"}]
[null,"Zinc oxide","1314-13-2",{"$f":"IFERROR(VLOOKUP(C610,RBCs!$B$5:$C$265,2,FALSE),\"NoRBC\")","v":"NoRBC"}]

{"sheet":"Dispersion Factors","index":8,"n_rows":58,"n_cols":33,"rows_kept":58,"cut":false,"hidden":false,"merged":[[17,1,17,31],[0,1,0,31],[1,1,1,31],[2,1,2,31],[3,1,3,31],[4,6,4,31],[18,6,18,31],[31,1,31,32],[32,7,32,32],[45,1,45,32],[46,7,46,32]]}
[null,"OAR 340-245-8050 Table 5"]
[null,"Level 1 Risk Assessment Tool"]
[null,"Dispersion Factors"]
[null,"Table 5A: Stack Emission Dispersion Factors for Annual Exposure (µg/m3 / pounds/year)"]
[null,"Stack",null,null,null,null,"Exposure Location Distance (meters)"]
[null,"Ht (m)",10,20,30,40,50,60,70,80,90,100,110,120,130,140,150,160,170,180,190,200,250,300,350,400,450,500,600,700,800,1000]
[null,5,1.0999999999999999E-2,6.0000000000000001E-3,5.1999999999999998E-3,4.1000000000000003E-3,3.3E-3,2.5999999999999999E-3,2.0999999999999999E-3,1.6999999999999999E-3,1.4E-3,1.1999999999999999E-3,1E-3,8.8000000000000003E-4,7.6000000000000004E-4,6.6E-4,5.8E-4,5.1000000000000004E-4,4.6000000000000001E-4,4.0999999999999999E-4,3.6999999999999999E-4,3.4000000000000002E-4,2.3000000000000001E-4,1.7000000000000001E-4,1.2999999999999999E-4,1E-4,8.3999999999999995E-5,7.1000000000000005E-5,5.1999999999999997E-5,4.0000000000000003E-5,3.1999999999999999E-5,2.1999999999999999E-5]
[null,10,9.4999999999999998E-3,4.5999999999999999E-3,2.7000000000000001E-3,1.6000000000000001E-3,1.4E-3,1.1999999999999999E-3,1.1000000000000001E-3,9.3999999999999997E-4,8.4000000000000003E-4,7.5000000000000002E-4,6.8000000000000005E-4,6.2E-4,5.6999999999999998E-4,5.1999999999999995E-4,4.8000000000000001E-4,4.4000000000000002E-4,4.0999999999999999E-4,3.8000000000000002E-4,3.5E-4,3.3E-4,2.3000000000000001E-4,1.7000000000000001E-4,1.2999999999999999E-4,9.7999999999999997E-5,7.7999999999999999E-5,6.3999999999999997E-5,4.6999999999999997E-5,3.6000000000000001E-5,2.9E-5,2.0999999999999999E-5]
[null,15,4.3E-3,3.0000000000000001E-3,1.8E-3,1.2999999999999999E-3,7.5000000000000002E-4,6.0999999999999997E-4,5.4000000000000001E-4,4.8999999999999998E-4,4.4000000000000002E-4,4.0000000000000002E-4,3.6999999999999999E-4,3.4000000000000002E-4,3.1E-4,2.9E-4,2.7E-4,2.5000000000000001E-4,2.4000000000000001E-4,2.3000000000000001E-4,2.1000000000000001E-4,2.0000000000000001E-4,1.6000000000000001E-4,1.2999999999999999E-4,1E-4,8.2999999999999998E-5,6.8999999999999997E-5,5.7000000000000003E-5,4.1E-5,3.1999999999999999E-5,2.5000000000000001E-5,1.8E-5]
[null,20,2.3E-3,1.8E-3,1.2999999999999999E-3,8.8000000000000003E-4,7.2000000000000005E-4,5.4000000000000001E-4,3.5E-4,3.1E-4,2.7999999999999998E-4,2.5999999999999998E-4,2.3000000000000001E-4,2.2000000000000001E-4,2.0000000000000001E-4,1.9000000000000001E-4,1.7000000000000001E-4,1.6000000000000001E-4,1.4999999999999999E-4,1.3999999999999999E-4,1.3999999999999999E-4,1.2999999999999999E-4,1E-4,8.6000000000000003E-5,7.2999999999999999E-5,6.2000000000000003E-5,5.3000000000000001E-5,4.6E-5,3.4999999999999997E-5,2.6999999999999999E-5,2.0999999999999999E-5,1.5E-5]
[null,25,1.2999999999999999E-3,1.1000000000000001E-3,9.1E-4,6.6E-4,5.0000000000000001E-4,4.0999999999999999E-4,3.5E-4,2.5000000000000001E-4,1.9000000000000001E-4,1.8000000000000001E-4,1.6000000000000001E-4,1.4999999999999999E-4,1.3999999999999999E-4,1.2999999999999999E-4,1.2E-4,1.2E-4,1.1E-4,1E-4,9.6000000000000002E-5,9.1000000000000003E-5,7.2000000000000002E-5,5.8999999999999998E-5,5.1E-5,4.3999999999999999E-5,3.8999999999999999E-5,3.4E-5,2.6999999999999999E-5,2.1999999999999999E-5,1.8E-5,1.2999999999999999E-5]
[null,30,8.1999999999999998E-4,7.2999999999999996E-4,6.2E-4,5.0000000000000001E-4,3.6999999999999999E-4,2.9999999999999997E-4,2.5999999999999998E-4,2.3000000000000001E-4,1.9000000000000001E-4,1.2999999999999999E-4,1.2E-4,1.1E-4,1E-4,9.6000000000000002E-5,9.0000000000000006E-5,8.5000000000000006E-5,8.0000000000000007E-5,7.4999999999999993E-5,7.1000000000000005E-5,6.7999999999999999E-5,5.3000000000000001E-5,4.3999999999999999E-5,3.6999999999999998E-5,3.1999999999999999E-5,2.8E-5,2.5000000000000001E-5,2.0999999999999999E-5,1.7E-5,1.4E-5,1.0000000000000001E-5]
[null,35,5.2999999999999998E-4,4.8999999999999998E-4,4.2999999999999999E-4,3.6999999999999999E-4,2.9999999999999997E-4,2.3000000000000001E-4,1.9000000000000001E-4,1.7000000000000001E-4,1.4999999999999999E-4,1.2999999999999999E-4,1.1E-4,8.1000000000000004E-5,7.4999999999999993E-5,7.1000000000000005E-5,6.7999999999999999E-5,6.3999999999999997E-5,6.0999999999999999E-5,5.8E-5,5.5000000000000002E-5,5.1999999999999997E-5,4.1999999999999998E-5,3.4E-5,2.9E-5,2.5000000000000001E-5,2.1999999999999999E-5,1.9000000000000001E-5,1.5999999999999999E-5,1.4E-5,1.1E-5,8.4435308375617604E-6]
[null,40,3.6999999999999999E-4,3.4000000000000002E-4,3.1E-4,2.7E-4,2.3000000000000001E-4,1.9000000000000001E-4,1.4999999999999999E-4,1.2999999999999999E-4,1.2E-4,1.1E-4,9.6000000000000002E-5,8.1000000000000004E-5,6.3999999999999997E-5,5.3999999999999998E-5,5.1E-5,4.8999999999999998E-5,4.6999999999999997E-5,4.5000000000000003E-5,4.3000000000000002E-5,4.1E-5,3.3000000000000003E-5,2.8E-5,2.3E-5,2.0000000000000002E-5,1.8E-5,1.5999999999999999E-5,1.2999999999999999E-5,1.1E-5,9.3306957262908366E-6,7.0463861920172599E-6]
[null,45,2.7E-4,2.5000000000000001E-4,2.3000000000000001E-4,2.1000000000000001E-4,1.8000000000000001E-4,1.6000000000000001E-4,1.2999999999999999E-4,1.1E-4,9.5000000000000005E-5,8.5000000000000006E-5,7.7999999999999999E-5,7.2000000000000002E-5,6.3E-5,5.3000000000000001E-5,4.1999999999999998E-5,3.8000000000000002E-5,3.6999999999999998E-5,3.6000000000000001E-5,3.4E-5,3.3000000000000003E-5,2.6999999999999999E-5,2.3E-5,1.9000000000000001E-5,1.7E-5,1.5E-5,1.2999999999999999E-5,1.1E-5,8.9914292753738986E-6,7.8039420938378147E-6,5.9786441061701769E-6]
[null,50,1.9000000000000001E-4,1.8000000000000001E-4,1.7000000000000001E-4,1.6000000000000001E-4,1.3999999999999999E-4,1.2999999999999999E-4,1.1E-4,9.0000000000000006E-5,7.7000000000000001E-5,6.7999999999999999E-5,6.2000000000000003E-5,5.7000000000000003E-5,5.3000000000000001E-5,4.8000000000000001E-5,4.1999999999999998E-5,3.4999999999999997E-5,2.9E-5,2.6999999999999999E-5,2.5999999999999998E-5,2.5999999999999998E-5,2.1999999999999999E-5,1.9000000000000001E-5,1.5999999999999999E-5,1.4E-5,1.2E-5,1.1E-5,8.9063639511499987E-6,7.4923175782758662E-6,6.4878694048237376E-6,5.077207772317446E-6]
[]
[null,"Table 5B: Stack Emission Dispersion Factors for 24 hour Exposure (µg/m3 / pounds/day)"]
[null,"Stack",null,null,null,null,"Exposure Location Distance (meters)"]
[null,"Ht (m)",10,20,30,40,50,60,70,80,90,100,110,120,130,140,150,160,170,180,190,200,250,300,350,400,450,500,600,700,800,1000]
[null,5,27,13,12,9.6999999999999993,8.3000000000000007,7.1,6.1,5.2,4.4000000000000004,3.8,3.2,2.7,2.4,2.1,1.8,1.6,1.4,1.3,1.2,1.1000000000000001,0.72,0.55000000000000004,0.44,0.36,0.3,0.26,0.2,0.16,0.13,9.1999999999999998E-2]
[null,10,9.8000000000000007,8.8000000000000007,6.5,4.0999999999999996,3.8,3.4,3.1,2.8,2.6,2.4,2.2000000000000002,2.1,2,1.8,1.7,1.6,1.5,1.4,1.3,1.3,0.91,0.67,0.5,0.38,0.3,0.25,0.18,0.14000000000000001,0.12,8.7999999999999995E-2]
[null,15,3.3,3.7,3.4,3,1.8,1.6,1.6,1.5,1.4,1.3,1.2,1.1000000000000001,1.1000000000000001,1,0.95,0.91,0.87,0.83,0.8,0.77,0.64,0.53,0.43,0.36,0.3,0.25,0.18,0.13,0.1,7.4999999999999997E-2]
[null,20,1.6,1.9,1.8,1.7,1.6,1.3,0.91,0.86,0.82,0.77,0.73,0.69,0.65,0.62,0.59,0.56000000000000005,0.54,0.52,0.49,0.48,0.4,0.35,0.31,0.27,0.23,0.2,0.16,0.12,9.6000000000000002E-2,6.4000000000000001E-2]
[null,25,0.83,0.99,1.1000000000000001,1,0.97,0.93,0.85,0.64,0.52,0.5,0.48,0.46,0.44,0.42,0.4,0.38,0.36,0.35,0.34,0.32,0.27,0.23,0.21,0.19,0.17,0.15,0.12,0.1,8.2000000000000003E-2,5.7000000000000002E-2]
[null,30,0.49,0.56999999999999995,0.64,0.65,0.62,0.59,0.56999999999999995,0.55000000000000004,0.49,0.34,0.32,0.31,0.3,0.28999999999999998,0.28000000000000003,0.27,0.26,0.25,0.24,0.23,0.19,0.17,0.15,0.13,0.12,0.11,9.5000000000000001E-2,7.8E-2,6.6000000000000003E-2,4.8000000000000001E-2]
[null,35,0.31,0.35,0.4,0.42,0.42,0.41,0.39,0.38,0.37,0.34,0.28999999999999998,0.22,0.21,0.21,0.2,0.2,0.19,0.18,0.18,0.17,0.15,0.13,0.11,9.9000000000000005E-2,0.09,8.3000000000000004E-2,7.1999999999999995E-2,6.2E-2,5.2999999999999999E-2,0.04]
[null,40,0.21,0.24,0.27,0.28999999999999998,0.3,0.28999999999999998,0.28000000000000003,0.28000000000000003,0.27,0.26,0.25,0.22,0.17,0.15,0.15,0.15,0.14000000000000001,0.14000000000000001,0.14000000000000001,0.13,0.11,0.1,8.7999999999999995E-2,7.8E-2,7.0000000000000007E-2,6.4000000000000001E-2,5.6000000000000001E-2,4.9000000000000002E-2,4.3999999999999997E-2,3.3000000000000002E-2]
[null,45,0.15,0.17,0.19,0.21,0.22,0.22,0.21,0.21,0.2,0.2,0.19,0.19,0.17,0.16,0.12,0.11,0.11,0.11,0.11,0.1,9.1999999999999998E-2,8.1000000000000003E-2,7.1999999999999995E-2,6.5000000000000002E-2,5.8000000000000003E-2,5.2999999999999999E-2,4.4999999999999998E-2,0.04,3.5999999999999997E-2,2.8000000000000001E-2]
[null,50,0.11,0.12,0.14000000000000001,0.15,0.16,0.16,0.16,0.16,0.16,0.15,0.15,0.14000000000000001,0.14000000000000001,0.13,0.12,0.1,8.2000000000000003E-2,8.1000000000000003E-2,0.08,7.9000000000000001E-2,7.1999999999999995E-2,6.5000000000000002E-2,5.8999999999999997E-2,5.2999999999999999E-2,4.8000000000000001E-2,4.3999999999999997E-2,3.6999999999999998E-2,3.2000000000000001E-2,2.9000000000000001E-2,2.4E-2]
[]
[null,"Table 5C: Fugitive Emission Dispersion Factors for Annual Exposure (µg/m3 / pounds/year)"]
[null,"Building Area","Building",null,null,null,null,"Exposure Location Distance (meters)"]
[null,"(1,000 ft2)","Height (ft)",10,20,30,40,50,60,70,80,90,100,110,120,130,140,150,160,170,180,190,200,250,300,350,400,450,500,600,700,800,1000]
[{"$f":"B35&\"_\"&C35","v":"≤3_≤20"},"≤3","≤20",1.0999999999999999E-2,6.0000000000000001E-3,5.1999999999999998E-3,4.1000000000000003E-3,4.4999999999999997E-3,3.3E-3,2.5999999999999999E-3,2E-3,1.6999999999999999E-3,1.4E-3,1.1999999999999999E-3,1E-3,8.8999999999999995E-4,7.7999999999999999E-4,6.8999999999999997E-4,6.2E-4,5.5999999999999995E-4,5.0000000000000001E-4,4.6000000000000001E-4,4.2000000000000002E-4,2.9E-4,2.1000000000000001E-4,1.6000000000000001E-4,1.2999999999999999E-4,1E-4,8.7000000000000001E-5,6.3999999999999997E-5,4.8999999999999998E-5,3.8999999999999999E-5,2.6999999999999999E-5]
[{"$f":"B36&\"_\"&C36","v":">3 to 6_≤20"},">3 to 6","≤20",9.4999999999999998E-3,4.5999999999999999E-3,2.7000000000000001E-3,1.6000000000000001E-3,4.4000000000000003E-3,3.2000000000000002E-3,2.5000000000000001E-3,2E-3,1.6000000000000001E-3,1.4E-3,1.1999999999999999E-3,1E-3,8.8000000000000003E-4,7.6999999999999996E-4,6.8999999999999997E-4,6.0999999999999997E-4,5.5000000000000003E-4,5.0000000000000001E-4,4.6000000000000001E-4,4.2000000000000002E-4,2.7999999999999998E-4,2.1000000000000001E-4,1.6000000000000001E-4,1.2999999999999999E-4,1E-4,8.7000000000000001E-5,6.3999999999999997E-5,4.8999999999999998E-5,3.8999999999999999E-5,2.6999999999999999E-5]
[">3 to 6_>20",">3 to 6",">20",4.3E-3,3.0000000000000001E-3,1.8E-3,1.2999999999999999E-3,4.1000000000000003E-3,3.0999999999999999E-3,2.3999999999999998E-3,1.9E-3,1.6000000000000001E-3,1.2999999999999999E-3,1.1000000000000001E-3,9.7999999999999997E-4,8.5999999999999998E-4,7.6000000000000004E-4,6.7000000000000002E-4,5.9999999999999995E-4,5.4000000000000001E-4,4.8999999999999998E-4,4.4999999999999999E-4,4.0999999999999999E-4,2.7999999999999998E-4,2.1000000000000001E-4,1.6000000000000001E-4,1.2999999999999999E-4,1E-4,8.7000000000000001E-5,6.3999999999999997E-5,4.8999999999999998E-5,3.8999999999999999E-5,2.6999999999999999E-5]
[">6 to 10_≤20",">6 to 10","≤20",2.3E-3,1.8E-3,1.2999999999999999E-3,8.8000000000000003E-4,4.4000000000000003E-3,3.3E-3,2.5000000000000001E-3,2E-3,1.6999999999999999E-3,1.4E-3,1.1999999999999999E-3,1E-3,8.8000000000000003E-4,7.6999999999999996E-4,6.8999999999999997E-4,6.2E-4,5.5000000000000003E-4,5.0000000000000001E-4,4.6000000000000001E-4,4.2000000000000002E-4,2.7999999999999998E-4,2.1000000000000001E-4,1.6000000000000001E-4,1.2999999999999999E-4,1E-4,8.7000000000000001E-5,6.3999999999999997E-5,4.8999999999999998E-5,3.8999999999999999E-5,2.6999999999999999E-5]
[">6 to 10_>20",">6 to 10",">20",1.2999999999999999E-3,1.1000000000000001E-3,9.1E-4,6.6E-4,3.7000000000000002E-3,2.8E-3,2.2000000000000001E-3,1.8E-3,1.5E-3,1.2999999999999999E-3,1.1000000000000001E-3,9.5E-4,8.3000000000000001E-4,7.3999999999999999E-4,6.6E-4,5.9000000000000003E-4,5.2999999999999998E-4,4.8000000000000001E-4,4.4000000000000002E-4,4.0999999999999999E-4,2.7999999999999998E-4,2.0000000000000001E-4,1.6000000000000001E-4,1.2999999999999999E-4,1E-4,8.6000000000000003E-5,6.3999999999999997E-5,4.8999999999999998E-5,3.8999999999999999E-5,2.6999999999999999E-5]
[">10 to 15_≤20",">10 to 15","≤20",8.1999999999999998E-4,7.2999999999999996E-4,6.2E-4,5.0000000000000001E-4,4.4000000000000003E-3,3.3E-3,2.5000000000000001E-3,2E-3,1.6999999999999999E-3,1.4E-3,1.1999999999999999E-3,1E-3,8.8000000000000003E-4,7.6999999999999996E-4,6.8999999999999997E-4,6.2E-4,5.5000000000000003E-4,5.0000000000000001E-4,4.6000000000000001E-4,4.2000000000000002E-4,2.7999999999999998E-4,2.1000000000000001E-4,1.6000000000000001E-4,1.2999999999999999E-4,1E-4,8.7000000000000001E-5,6.3999999999999997E-5,4.8999999999999998E-5,3.8999999999999999E-5,2.6999999999999999E-5]
[">10 to 15_>20",">10 to 15",">20",5.2999999999999998E-4,4.8999999999999998E-4,4.2999999999999999E-4,3.6999999999999999E-4,3.3999999999999998E-3,2.7000000000000001E-3,2.0999999999999999E-3,1.8E-3,1.5E-3,1.1999999999999999E-3,1.1000000000000001E-3,9.3000000000000005E-4,8.0999999999999996E-4,7.2000000000000005E-4,6.4000000000000005E-4,5.8E-4,5.1999999999999995E-4,4.8000000000000001E-4,4.4000000000000002E-4,4.0000000000000002E-4,2.7999999999999998E-4,2.0000000000000001E-4,1.6000000000000001E-4,1.2E-4,1E-4,8.6000000000000003E-5,6.3E-5,4.8999999999999998E-5,3.8999999999999999E-5,2.6999999999999999E-5]
[">15 to 30_≤20",">15 to 30","≤20",3.6999999999999999E-4,3.4000000000000002E-4,3.1E-4,2.7E-4,4.3E-3,3.2000000000000002E-3,2.5000000000000001E-3,2E-3,1.6000000000000001E-3,1.4E-3,1.1999999999999999E-3,1E-3,8.8000000000000003E-4,7.6999999999999996E-4,6.8999999999999997E-4,6.0999999999999997E-4,5.5000000000000003E-4,5.0000000000000001E-4,4.6000000000000001E-4,4.2000000000000002E-4,2.7999999999999998E-4,2.1000000000000001E-4,1.6000000000000001E-4,1.2999999999999999E-4,1E-4,8.7000000000000001E-5,6.3999999999999997E-5,4.8999999999999998E-5,3.8999999999999999E-5,2.6999999999999999E-5]
[">15 to 30_>20",">15 to 30",">20",2.7E-4,2.5000000000000001E-4,2.3000000000000001E-4,2.1000000000000001E-4,3.3999999999999998E-3,2.7000000000000001E-3,2.0999999999999999E-3,1.8E-3,1.5E-3,1.1999999999999999E-3,1.1000000000000001E-3,9.3000000000000005E-4,8.1999999999999998E-4,7.2000000000000005E-4,6.4999999999999997E-4,5.8E-4,5.1999999999999995E-4,4.8000000000000001E-4,4.4000000000000002E-4,4.0000000000000002E-4,2.7999999999999998E-4,2.0000000000000001E-4,1.6000000000000001E-4,1.2999999999999999E-4,1E-4,8.6000000000000003E-5,6.3E-5,4.8999999999999998E-5,3.8999999999999999E-5,2.6999999999999999E-5]
[">30_>20",">30",">20",1.9000000000000001E-4,1.8000000000000001E-4,1.7000000000000001E-4,1.6000000000000001E-4,2.2000000000000001E-3,1.8E-3,1.5E-3,1.2999999999999999E-3,1.1000000000000001E-3,9.7999999999999997E-4,8.5999999999999998E-4,7.6000000000000004E-4,6.8000000000000005E-4,6.0999999999999997E-4,5.5000000000000003E-4,5.0000000000000001E-4,4.6000000000000001E-4,4.2000000000000002E-4,3.8999999999999999E-4,3.6000000000000002E-4,2.5000000000000001E-4,1.9000000000000001E-4,1.4999999999999999E-4,1.2E-4,9.7999999999999997E-5,8.2999999999999998E-5,6.0999999999999999E-5,4.8000000000000001E-5,3.8000000000000002E-5,2.6999999999999999E-5]
[]
[null,"Table 5D: Fugitive Emission Dispersion Factors for 24 hour Exposure (µg/m3 / pounds/day)"]
[null,"Building Area","Building",null,null,null,null,"Exposure Location Distance (meters)"]
[null,"(1,000 ft2)","Height (ft)",10,20,30,40,50,60,70,80,90,100,110,120,130,140,150,160,170,180,190,200,250,300,350,400,450,500,600,700,800,1000]
[{"$f":"B49&\"_\"&C49","v":"≤3_≤20"},"≤3","≤20",1.0999999999999999E-2,6.0000000000000001E-3,5.1999999999999998E-3,4.1000000000000003E-3,4.8,3.7,2.9,2.4,2,1.7,1.4,1.2,1.1000000000000001,0.97,0.87,0.78,0.71,0.65,0.59,0.55000000000000004,0.38,0.28999999999999998,0.22,0.18,0.15,0.13,9.5000000000000001E-2,7.3999999999999996E-2,0.06,4.2999999999999997E-2]
[{"$f":"B50&\"_\"&C50","v":">3 to 6_≤20"},">3 to 6","≤20",9.4999999999999998E-3,4.5999999999999999E-3,2.7000000000000001E-3,1.6000000000000001E-3,4.0999999999999996,3.1,2.5,2,1.7,1.4,1.2,1.1000000000000001,0.95,0.84,0.76,0.68,0.62,0.56999999999999995,0.52,0.48,0.33,0.25,0.2,0.16,0.13,0.11,8.3000000000000004E-2,6.5000000000000002E-2,5.2999999999999999E-2,3.7999999999999999E-2]
[">3 to 6_>20",">3 to 6",">20",4.3E-3,3.0000000000000001E-3,1.8E-3,1.2999999999999999E-3,3.5,2.8,2.2000000000000002,1.9,1.6,1.3,1.2,1,0.9,0.8,0.72,0.65,0.59,0.54,0.5,0.46,0.32,0.24,0.19,0.15,0.13,0.11,8.1000000000000003E-2,6.4000000000000001E-2,5.1999999999999998E-2,3.6999999999999998E-2]
[">6 to 10_≤20",">6 to 10","≤20",2.3E-3,1.8E-3,1.2999999999999999E-3,8.8000000000000003E-4,4,3.1,2.5,2,1.7,1.4,1.2,1.1000000000000001,0.94,0.84,0.75,0.68,0.62,0.56000000000000005,0.52,0.48,0.33,0.25,0.2,0.16,0.13,0.11,8.3000000000000004E-2,6.5000000000000002E-2,5.2999999999999999E-2,3.7999999999999999E-2]
[">6 to 10_>20",">6 to 10",">20",1.2999999999999999E-3,1.1000000000000001E-3,9.1E-4,6.6E-4,3.3,2.6,2.1,1.8,1.5,1.3,1.1000000000000001,0.97,0.86,0.77,0.69,0.63,0.56999999999999995,0.53,0.48,0.45,0.31,0.24,0.19,0.15,0.12,0.11,0.08,6.3E-2,5.0999999999999997E-2,3.5999999999999997E-2]
[">10 to 15_≤20",">10 to 15","≤20",8.1999999999999998E-4,7.2999999999999996E-4,6.2E-4,5.0000000000000001E-4,4,3.1,2.4,2,1.7,1.4,1.2,1.1000000000000001,0.94,0.84,0.75,0.68,0.62,0.56000000000000005,0.52,0.48,0.33,0.25,0.19,0.16,0.13,0.11,8.3000000000000004E-2,6.5000000000000002E-2,5.2999999999999999E-2,3.7999999999999999E-2]
[">10 to 15_>20",">10 to 15",">20",5.2999999999999998E-4,4.8999999999999998E-4,4.2999999999999999E-4,3.6999999999999999E-4,2.9,2.4,2,1.6,1.4,1.2,1.1000000000000001,0.93,0.83,0.74,0.67,0.61,0.56000000000000005,0.51,0.47,0.43,0.31,0.23,0.18,0.15,0.12,0.1,7.8E-2,6.2E-2,0.05,3.5000000000000003E-2]
[">15 to 30_≤20",">15 to 30","≤20",3.6999999999999999E-4,3.4000000000000002E-4,3.1E-4,2.7E-4,3.7,2.9,2.2999999999999998,1.9,1.6,1.4,1.2,1,0.92,0.82,0.74,0.67,0.61,0.55000000000000004,0.51,0.47,0.33,0.25,0.19,0.16,0.13,0.11,8.3000000000000004E-2,6.5000000000000002E-2,5.2999999999999999E-2,3.6999999999999998E-2]
[">15 to 30_>20",">15 to 30",">20",2.7E-4,2.5000000000000001E-4,2.3000000000000001E-4,2.1000000000000001E-4,2.9,2.2999999999999998,1.9,1.6,1.4,1.2,1,0.92,0.82,0.74,0.67,0.6,0.55000000000000004,0.51,0.47,0.43,0.31,0.23,0.18,0.15,0.12,0.1,7.8E-2,6.2E-2,0.05,3.5000000000000003E-2]
[">30_>20",">30",">20",1.9000000000000001E-4,1.8000000000000001E-4,1.7000000000000001E-4,1.6000000000000001E-4,1.8,1.5,1.3,1.2,1,0.92,0.82,0.73,0.66,0.6,0.55000000000000004,0.51,0.47,0.43,0.4,0.37,0.27,0.21,0.17,0.14000000000000001,0.12,9.8000000000000004E-2,7.4999999999999997E-2,5.8999999999999997E-2,4.8000000000000001E-2,3.4000000000000002E-2]